{"text_format":"1","workbook":"xlsx","n_sheets":2,"sheets":["1° INST_NYA_ADN","DATOS"],"not_rendered":{"charts":0,"images":0,"macros":1,"external_links":2,"defined_names":2,"comments":0,"pivot_tables":0},"unopened":[],"bounds":{"document_bytes":16777216,"sheet_cells":100000,"rows_first":2000,"rows_last":500,"rows_between":2000,"halvings":0,"cell_chars":16384,"cell_head_chars":4096},"cells_cut":0,"cells_raw":0,"read":"whole","date_system":"1900"}

{"sheet":"1° INST_NYA_ADN","index":0,"n_rows":1011,"n_cols":17,"rows_kept":1011,"cut":false,"hidden":false,"merged":[[3,0,3,1],[2,0,2,1],[8,0,8,1],[7,0,7,1],[6,0,6,1],[5,0,5,1],[4,0,4,1],[2,2,2,11],[5,2,5,11],[4,2,4,11],[3,2,3,11],[9,5,10,5],[9,7,10,7],[9,8,10,8],[9,10,10,10],[9,16,10,16],[9,11,9,15],[9,9,10,9],[9,6,10,6],[9,0,10,0],[9,1,10,1],[9,4,10,4],[9,2,10,2],[9,3,10,3],[0,0,0,16],[1,0,1,16],[5,16,6,16],[7,16,8,16],[3,16,4,16],[6,8,6,11],[3,12,8,13],[3,14,4,15],[5,14,6,15],[7,14,8,15],[2,13,2,16],[6,2,6,6],[7,2,7,6],[8,2,8,6],[7,8,7,9],[8,8,8,9]]}
["JUZGADOS DE PRIMERA INSTANCIA DEL FUERO DE LA NIÑEZ Y DE LA ADOLESCENCIA DE LA REPÚBLICA DEL PARAGUAY"]
["ESTE FORMULARIO APLICA EXCLUSIVAMENTE PARA INFORMAR LOS EXPEDIENTES TRAMITADOS CON LA DEFENSA PÚBLICA Y QUE EN LOS MISMOS SE HA APROBADO LA REALIZACIÓN DE LA PRUEBA DE A.D.N."]
["CIRCUNSCRIPCIÓN JUDICIAL: ",null,{"$f":"IF(DATOS!H14=0,\"SELECCIONE SU CIRCUNSCRIPCIÓN----->\",IF(DATOS!H14=1,\"1° CAPITAL\",IF(DATOS!H14=2,\"2° GUAIRÁ\",IF(DATOS!H14=3,\"3° ITAPÚA\",IF(DATOS!H14=4,\"4° CONCEPCIÓN\",IF(DATOS!H14=5,\"5°AMAMBAY\",IF(DATOS!H14=6,\"6° ALTO PARANÁ\",IF(DATOS!H14=7,\"7° CAAGUAZÚ\",IF(DATOS!H14=8,\" 8° ÑEEMBUCÚ\",IF(DATOS!H14=9,\" 9° MISIONES\",IF(DATOS!H14=10,\"10° PARAGUARÍ\",IF(DATOS!H14=11,\"11° CAAZAPÁ\",IF(DATOS!H14=12,\"12° SAN PEDRO\",IF(DATOS!H14=13,\"13° CORDILLERA\",IF(DATOS!H14=14,\"14° PRESIDENTE HAYES\",IF(DATOS!H14=15,\"15° CANINDEYÚ\",IF(DATOS!H14=16,\"16° CENTRAL\",IF(DATOS!H14=17,\"17° BOQUERÓN\",IF(DATOS!H14=18,\"18° ALTO PARAGUAY\")))))))))))))))))))","v":"SELECCIONE SU CIRCUNSCRIPCIÓN----->"},null,null,null,null,null,null,null,null,null,"AÑO:"]
["CIUDAD:",null,{"$f":"IF(DATOS!H14=0,\"SELECCIONE PRIMERO SU CIRCUNSCRIPCIÓN\",IF(DATOS!H24=0,\"SELECCIONE SU CIUDAD---->\",DATOS!H27))","v":"SELECCIONE PRIMERO SU CIRCUNSCRIPCIÓN"},null,null,null,null,null,null,null,null,null,"PERIODO - CUATRIMESTRE",null,"1° CUATRIMESTRE "]
["JUZGADO DE PRIMERA INSTANCIA:",null,{"$f":"IF(DATOS!F18=0,\"SELECCIONE SU JUZGADO ----->\",IF(DATOS!F18=1,DATOS!D14,IF(DATOS!F18=2,DATOS!D15,IF(DATOS!F18=3,DATOS!D16,IF(DATOS!F18=4,DATOS!D17)))))","v":"SELECCIONE SU JUZGADO ----->"}]
["TURNO:",null,{"$f":"IF(DATOS!H17=0,\"SELECCIONE SU TURNO----->\",IF(DATOS!H17=1,\"UT\",IF(DATOS!H17=2,\"1T\",IF(DATOS!H17=3,\"2T\",IF(DATOS!H17=4,\"3T\",IF(DATOS!H17=5,\"4T\",IF(DATOS!H17=6,\"5T\",IF(DATOS!H17=7,\"6T\",IF(DATOS!H17=8,\"7T\",IF(DATOS!H17=9,\"8T\",IF(DATOS!H17=10,\"9T\",IF(DATOS!H17=11,\"10T\",IF(DATOS!H17=12,\"11T\",IF(DATOS!H17=13,\"12T\",IF(DATOS!H17=14,\"13T\",IF(DATOS!H17=15,\"14T\",IF(DATOS!H17=16,\"15T\",IF(DATOS!H17=17,\"16T\",IF(DATOS!H17=18,\"17T\",IF(DATOS!H17=19,\"18T\",IF(DATOS!H17=20,\"19T\",IF(DATOS!H17=21,\"20T\",IF(DATOS!H17=22,\"21T\",IF(DATOS!H17=23,\"22T\",IF(DATOS!H17=24,\"23T\",IF(DATOS!H17=25,\"24T\",IF(DATOS!H17=26,\"25T\",IF(DATOS!H17=27,\"26T\",IF(DATOS!H17=28,\"27T\",IF(DATOS!H17=29,\"28T\",IF(DATOS!H17=30,\"29T\",IF(DATOS!H17=31,\"30T\"))))))))))))))))))))))))))))))))","v":"SELECCIONE SU TURNO----->"},null,null,null,null,null,null,null,null,null,null,null,"2° CUATRIMESTRE"]
["NOMBRE COMPLETO DEL MAGISTRADO/A: ",null,null,null,null,null,null,"VINCULACIÓN:"]
["NOMBRE COMPLETO DEL ACTUARIO/A:",null,null,null,null,null,null,"VINCULACIÓN:",null,null,"SECRETARÍA N°:",null,null,null,"3° CUATRIMESTRE "]
["NOMBRE COMPLETO DEL ACTUARIO/A:",null,null,null,null,null,null,"VINCULACIÓN:",null,null,"SECRETARÍA N°:"]
["N°                             ÍTEM","CARÁTULA COMPLETA ","N° DE                      EXPEDIENTE","AÑO DEL EXPEDIENTE ","TIPO DE RESOLUCIÓN POR LA CUAL EL JUZGADO APROBÓ LA REALIZACIÓN DE LA PRUEBA DE A.D.N.","INGRESE EL NÚMERO DE RESOLUCIÓN DEL JUZGADO EN CASO DE APLICAR","FECHA DE RESOLUCIÓN DEL JUZGADO","EL CONSEJO DE SUPERINTENDENCIA YA APROBÓ LA REALIZACIÓN DE LA PRUEBA DE A.D.N.","INGRESE EL NÚMERO DE RESOLUCIÓN DEL CONSEJO DE SUPERINTENDENCIA  ","FECHA DE RESOLUCIÓN DEL CONSEJO DE SUPERINTENDENCIA  ","A FAVOR DE QUE PARTE SE APROBÓ LA REALIZACIÓN DE LA PRUEBA DE ADN","A LA FECHA DEL INFORME, LA PRUEBA DE A.D.N. ",null,null,null,null,"SECRETARÍA N°:"]
[null,null,null,null,null,null,null,null,null,null,null,"¿YA SE HA REALIZADO?  ","EN CASO AFIRMATIVO, ¿YA SE HA COMUNICADO A LA DIRECCIÓN GENERAL DE ADMINISTRACIÓN Y FINANZAS?  ","EN CASO NEGATIVO, ELIJA EL MOTIVO POR EL CUAL AÚN NO SE HA REALIZADO LA PRUEBA DE ADN  ","EN CASO DE SELECCIONAR OTRO/S EN LA COLUMNA ANTERIOR, FAVOR DETALLAR EL MOTIVO EN ESTA COLUMNA","CANTIDAD DE VECES QUE SE SUSPENDIÓ LA REALIZACIÓN DE LA PRUEBA DE A.D.N."]
[1]
[{"$f":"IF(B13<>\"\",A12+1,\"\")","v":""}]
[{"$f":"IF(B14<>\"\",A13+1,\"\")","v":""}]
[""]
[""]
[""]
[""]
[""]
[""]
[""]
[""]
[""]
[""]
[""]
[""]
[""]
[""]
[""]
[""]
[""]
[""]
[""]
[""]
[""]
[""]
[""]
[""]
[""]
[""]
[""]
[""]
[""]
[""]
[""]
[""]
[""]
[""]
[""]
[""]
[""]
[""]
[""]
[""]
[""]
[""]
[""]
[""]
[""]
[""]
[""]
[""]
[""]
[""]
[""]
[""]
[""]
[""]
[""]
[""]
[""]
[""]
[""]
[""]
[""]
[""]
[""]
[{"$f":"IF(B78<>\"\",A77+1,\"\")","v":""}]
[""]
[""]
[""]
[""]
[""]
[""]
[""]
[""]
[""]
[""]
[""]
[""]
[""]
[""]
[""]
[""]
[""]
[""]
[""]
[""]
[""]
[""]
[""]
[""]
[""]
[""]
[""]
[""]
[""]
[""]
[""]
[""]
[""]
[""]
[""]
[""]
[""]
[""]
[""]
[""]
[""]
[""]
[""]
[""]
[""]
[""]
[""]
[""]
[""]
[""]
[""]
[""]
[""]
[""]
[""]
[""]
[""]
[""]
[""]
[""]
[""]
[""]
[""]
[{"$f":"IF(B142<>\"\",A141+1,\"\")","v":""}]
[""]
[""]
[""]
[""]
[""]
[""]
[""]
[""]
[""]
[""]
[""]
[""]
[""]
[""]
[""]
[""]
[""]
[""]
[""]
[""]
[""]
[""]
[""]
[""]
[""]
[""]
[""]
[""]
[""]
[""]
[""]
[""]
[""]
[""]
[""]
[""]
[""]
[""]
[""]
[""]
[""]
[""]
[""]
[""]
[""]
[""]
[""]
[""]
[""]
[""]
[""]
[""]
[""]
[""]
[""]
[""]
[""]
[""]
[""]
[""]
[""]
[""]
[""]
[{"$f":"IF(B206<>\"\",A205+1,\"\")","v":""}]
[""]
[""]
[""]
[""]
[""]
[""]
[""]
[""]
[""]
[""]
[""]
[""]
[""]
[""]
[""]
[""]
[""]
[""]
[""]
[""]
[""]
[""]
[""]
[""]
[""]
[""]
[""]
[""]
[""]
[""]
[""]
[""]
[""]
[""]
[""]
[""]
[""]
[""]
[""]
[""]
[""]
[""]
[""]
[""]
[""]
[""]
[""]
[""]
[""]
[""]
[""]
[""]
[""]
[""]
[""]
[""]
[""]
[""]
[""]
[""]
[""]
[""]
[""]
[{"$f":"IF(B270<>\"\",A269+1,\"\")","v":""}]
[""]
[""]
[""]
[""]
[""]
[""]
[""]
[""]
[""]
[""]
[""]
[""]
[""]
[""]
[""]
[""]
[""]
[""]
[""]
[""]
[""]
[""]
[""]
[""]
[""]
[""]
[""]
[""]
[""]
[""]
[""]
[""]
[""]
[""]
[""]
[""]
[""]
[""]
[""]
[""]
[""]
[""]
[""]
[""]
[""]
[""]
[""]
[""]
[""]
[""]
[""]
[""]
[""]
[""]
[""]
[""]
[""]
[""]
[""]
[""]
[""]
[""]
[""]
[{"$f":"IF(B334<>\"\",A333+1,\"\")","v":""}]
[""]
[""]
[""]
[""]
[""]
[""]
[""]
[""]
[""]
[""]
[""]
[""]
[""]
[""]
[""]
[""]
[""]
[""]
[""]
[""]
[""]
[""]
[""]
[""]
[""]
[""]
[""]
[""]
[""]
[""]
[""]
[""]
[""]
[""]
[""]
[""]
[""]
[""]
[""]
[""]
[""]
[""]
[""]
[""]
[""]
[""]
[""]
[""]
[""]
[""]
[""]
[""]
[""]
[""]
[""]
[""]
[""]
[""]
[""]
[""]
[""]
[""]
[""]
[{"$f":"IF(B398<>\"\",A397+1,\"\")","v":""}]
[""]
[""]
{"$rows_left_out":612}
{"sheet":"DATOS","index":1,"n_rows":203,"n_cols":12,"rows_kept":203,"cut":false,"hidden":true,"merged":[[1,1,2,10]]}
[]
[null,"VALIDACIONES DE LA PLANILLA DE PENDENCIA"]
[]
[]
[]
[null,null,{"$f":"IF(DATOS!H17=0,\"SELECCIONE SU TURNO----->\",IF(DATOS!H17=1,\"UT\",IF(DATOS!H17=2,\"1T\",IF(DATOS!H17=3,\"2T\",IF(DATOS!H17=4,\"3T\",IF(DATOS!H17=5,\"4T\",IF(DATOS!H17=6,\"5T\",IF(DATOS!H17=7,\"6T\",IF(DATOS!H17=8,\"7T\",IF(DATOS!H17=9,\"8T\",IF(DATOS!H17=10,\"9T\",IF(DATOS!H17=11,\"10T\",IF(DATOS!H17=12,\"11T\",IF(DATOS!H17=13,\"12T\",IF(DATOS!H17=14,\"13T\",IF(DATOS!H17=15,\"14T\",IF(DATOS!H17=16,\"15T\",IF(DATOS!H17=17,\"16T\",IF(DATOS!H17=18,\"17T\",IF(DATOS!H17=19,\"18T\",IF(DATOS!H17=20,\"19T\",IF(DATOS!H17=21,\"20T\",IF(DATOS!H17=22,\"21T\",IF(DATOS!H17=22,\"22T\",IF([2]DATOS!H13=23,\"N22\",IF([2]DATOS!H13=24,\"N23\",IF([2]DATOS!H13=25,\"N24\",IF([2]DATOS!H13=26,\"N25\",IF([2]DATOS!H13=27,\"N26\",IF([2]DATOS!H13=28,\"N27\",IF([2]DATOS!H13=29,\"N28\",IF([2]DATOS!H13=30,\"N29\",IF([2]DATOS!H13=31,\"N30\",IF([2]DATOS!H13=32,\"N31\",IF([2]DATOS!H13=32,\"N31\",IF([2]DATOS!H13=33,\"N32\",IF([2]DATOS!H13=34,\"N33\",IF([2]DATOS!H13=35,\"N34\",IF([2]DATOS!H13=36,\"N35\",IF([2]DATOS!H13=37,\"N36\",IF([2]DATOS!H13=38,\"N37\",IF([2]DATOS!H13=39,\"N38\",IF([2]DATOS!H13=40,\"N39\",IF([2]DATOS!H13=41,\"N40\"))))))))))))))))))))))))))))))))))))))))))))","v":"SELECCIONE SU TURNO----->"}]
[]
[null,null,null,"VINCULACIÓN",null,"EL CONSEJO DE SUPERINTENDENCIA YA APROBÓ LA REALIZACIÓN DE LA PRUEBA DE A.D.N.",null,"A FAVOR DE QUE PARTE SE APRUEBA LA REALIZACIÓN DE LA PRUEBA DE ADN"]
[null,null,null,"TITULAR",null,"SÍ",null,"PARTE ACTORA"]
[null,null,null,"INTERINO/A",null,"NO",null,"PARTE DEMANDANTE"]
[null,null,null,"ITINERANTE"]
[]
[null,null,null,"FUERO",null,"AL MOMENTO DEL INFORME, LA PRUEBA DE ADN ¿YA SE HA REALIZADO?  ",null,"SELEC / CIRCUNSP",null,"EN CASO AFIRMATIVO, ¿YA SE HA COMUNICADO A LA DIRECCIÓN DE ADMINISTRACIÓN Y FINANZAS?  ",null,"EN CASO NEGATIVO, ELIJA EL MOTIVO POR EL CUAL AÚN NO SE HA REALIZADO LA PRUEBA DE ADN  "]
[null,null,null,"DE LA NIÑEZ Y DE LA ADOLESCENCIA",null,"SÍ",null,0,null,"SÍ",null,"AUSENCIA DEL/DE LA JUEZ/A"]
[null,null,null,"CIVIL, COMERCIAL, LABORAL, DE LA NIÑEZ Y DE LA ADOLESCENCIA",null,"NO",null,null,null,"NO",null,"AUSENCIA DEL/DE LA ACTUARIO/A"]
[null,null,null,"CIVIL, COMERCIAL, LABORAL, DE LA NIÑEZ Y DE LA ADOLESCENCIA Y PENAL DE GARANTÍAS",null,null,null,"SELEC / TURNO",null,null,null,"FALTA DE NOTIFICACIÓN"]
[null,null,null,"CIVIL, COMERCIAL, LABORAL, DE LA NIÑEZ Y ADOLESCENCIA, PENAL DE GARANTÍAS Y PENAL DE GARANTÍAS DE LA ADOLESCENCIA",null,"SELEC / FUERO",null,0,null,null,null,"INCOMPARECENCIA DE LA MADRE"]
[null,null,null,null,null,0,null,null,null,null,null,"INCOMPARECENCIA DEL PADRE"]
[null,null,null,"VINCULACIÓN",null,"TIPO DE RESOLUCIÓN POR LA CUAL EL JUZGADO APROBÓ LA REALIZACIÓN DE LA PRUEBA DE A.D.N.",null,"SELEC / CUATRI",null,null,null,"INCOMPARECENCIA DE LA / DEL NIÑA-O / ADOLESCENTE "]
[null,null,null,"TITULAR",null,"PROVIDENCIA",null,1,null,null,null,"INCOMPARECENCIA DE LA DEFENSA PÚBLICA"]
[null,null,null,"INTERINO/A",null,"A.I.",null,null,null,null,null,"INCOMPARECENCIA DEL LABORATORIO"]
[null,null,null,"COMISIONADO/A",null,null,null,null,null,null,null,"OTRO/S"]
[null,null,null,null,"N°","LOCALIDAD / CIUDAD","Columna1","SELEC / CIUDAD"]
[null,null,null,null,1,"ASUNCIÓN",1,0]
[null,null,null,null,1,"HACER CLIC AL BOTÓN ABAJO 1 VEZ",2]
[null,null,null,null,1,"HACER CLIC AL BOTÓN ABAJO 2 VECES",3,"TRAE LA CIUDAD "]
[null,null,null,null,1,"HACER CLIC AL BOTÓN ABAJO 3 VECES",4,{"$f":"IFERROR(INDEX(DATOS!$F$24:$F$203, SMALL(IF(DATOS!$E$24:$E$203=DATOS!H14, ROW(DATOS!$E$24:$E$203)-ROW(DATOS!$E$24)+1), DATOS!H24)), \"\")","v":""}]
[null,null,null,null,1,"HACER CLIC AL BOTÓN ABAJO 4 VECES",5]
[null,null,null,null,1,"HACER CLIC AL BOTÓN ABAJO 5 VECES",6]
[null,null,null,null,1,"HACER CLIC AL BOTÓN ABAJO 6 VECES",7]
[null,null,null,null,1,"HACER CLIC AL BOTÓN ABAJO 7 VECES",8]
[null,null,null,null,1,"HACER CLIC AL BOTÓN ABAJO 8 VECES",9]
[null,null,null,null,1,"HACER CLIC AL BOTÓN ABAJO 9 VECES",10]
[null,null,null,null,2,"VILLARRICA",1]
[null,null,null,null,2,"HACER CLIC AL BOTÓN ABAJO 1 VEZ",2]
[null,null,null,null,2,"HACER CLIC AL BOTÓN ABAJO 2 VECES",3]
[null,null,null,null,2,"HACER CLIC AL BOTÓN ABAJO 3 VECES",4]
[null,null,null,null,2,"HACER CLIC AL BOTÓN ABAJO 4 VECES",5]
[null,null,null,null,2,"HACER CLIC AL BOTÓN ABAJO 5 VECES",6]
[null,null,null,null,2,"HACER CLIC AL BOTÓN ABAJO 6 VECES",7]
[null,null,null,null,2,"HACER CLIC AL BOTÓN ABAJO 7 VECES",8]
[null,null,null,null,2,"HACER CLIC AL BOTÓN ABAJO 8 VECES",9]
[null,null,null,null,2,"HACER CLIC AL BOTÓN ABAJO 9 VECES",10]
[null,null,null,null,3,"ENCARNACIÓN",1]
[null,null,null,null,3,"HACER CLIC AL BOTÓN ABAJO 1 VEZ",2]
[null,null,null,null,3,"HACER CLIC AL BOTÓN ABAJO 2 VECES",3]
[null,null,null,null,3,"HACER CLIC AL BOTÓN ABAJO 3 VECES",4]
[null,null,null,null,3,"HACER CLIC AL BOTÓN ABAJO 4 VECES",5]
[null,null,null,null,3,"HACER CLIC AL BOTÓN ABAJO 5 VECES",6]
[null,null,null,null,3,"HACER CLIC AL BOTÓN ABAJO 6 VECES",7]
[null,null,null,null,3,"HACER CLIC AL BOTÓN ABAJO 7 VECES",8]
[null,null,null,null,3,"HACER CLIC AL BOTÓN ABAJO 8 VECES",9]
[null,null,null,null,3,"HACER CLIC AL BOTÓN ABAJO 9 VECES",10]
[null,null,null,null,4,"CONCEPCIÓN",1]
[null,null,null,null,4,"HORQUETA Y ARROYITO",2]
[null,null,null,null,4,"VALLEMI",3]
[null,null,null,null,4,"YBY YAÚ Y AZOTE´Y",4]
[null,null,null,null,4,"HACER CLIC AL BOTÓN ABAJO 1 VEZ",5]
[null,null,null,null,4,"HACER CLIC AL BOTÓN ABAJO 2 VECES",6]
[null,null,null,null,4,"HACER CLIC AL BOTÓN ABAJO 3 VECES",7]
[null,null,null,null,4,"HACER CLIC AL BOTÓN ABAJO 4 VECES",8]
[null,null,null,null,4,"HACER CLIC AL BOTÓN ABAJO 5 VECES",9]
[null,null,null,null,4,"HACER CLIC AL BOTÓN ABAJO 6 VECES",10]
[null,null,null,null,5,"CAPITÁN BADO",1]
[null,null,null,null,5,"PEDRO JUAN CABALLERO",2]
[null,null,null,null,5,"HACER CLIC AL BOTÓN ABAJO 1 VEZ",3]
[null,null,null,null,5,"HACER CLIC AL BOTÓN ABAJO 2 VECES",4]
[null,null,null,null,5,"HACER CLIC AL BOTÓN ABAJO 3 VECES",5]
[null,null,null,null,5,"HACER CLIC AL BOTÓN ABAJO 4 VECES",6]
[null,null,null,null,5,"HACER CLIC AL BOTÓN ABAJO 5 VECES",7]
[null,null,null,null,5,"HACER CLIC AL BOTÓN ABAJO 6 VECES",8]
[null,null,null,null,5,"HACER CLIC AL BOTÓN ABAJO 7 VECES",9]
[null,null,null,null,5,"HACER CLIC AL BOTÓN ABAJO 8 VECES",10]
[null,null,null,null,6,"CIUDAD DEL ESTE",1]
[null,null,null,null,6,"HERNANDARIAS",2]
[null,null,null,null,6,"ITAKYRY",3]
[null,null,null,null,6,"MINGA PORÁ",4]
[null,null,null,null,6,"NARANJAL",5]
[null,null,null,null,6,"PRESIDENTE FRANCO",6]
[null,null,null,null,6,"SANTA RITA",7]
[null,null,null,null,6,"HACER CLIC AL BOTÓN ABAJO 1 VEZ",8]
[null,null,null,null,6,"HACER CLIC AL BOTÓN ABAJO 2 VECES",9]
[null,null,null,null,6,"HACER CLIC AL BOTÓN ABAJO 3 VECES",10]
[null,null,null,null,7,"CAAGUAZÚ",1]
[null,null,null,null,7,"CORONEL OVIEDO",2]
[null,null,null,null,7," JUAN EULOGIO ESTIGARRIBIA",3]
[null,null,null,null,7,"HACER CLIC AL BOTÓN ABAJO 1 VEZ",4]
[null,null,null,null,7,"HACER CLIC AL BOTÓN ABAJO 2 VECES",5]
[null,null,null,null,7,"HACER CLIC AL BOTÓN ABAJO 3 VECES",6]
[null,null,null,null,7,"HACER CLIC AL BOTÓN ABAJO 4 VECES",7]
[null,null,null,null,7,"HACER CLIC AL BOTÓN ABAJO 5 VECES",8]
[null,null,null,null,null,"HACER CLIC AL BOTÓN ABAJO 6 VECES",9]
[null,null,null,null,7,"HACER CLIC AL BOTÓN ABAJO 7 VECES",10]
[null,null,null,null,8,"ALBERDI-VILLA FRANCA-VILLA OLIVA",1]
[null,null,null,null,8,"PILAR",2]
[null,null,null,null,8,"HACER CLIC AL BOTÓN ABAJO 1 VEZ",3]
[null,null,null,null,8,"HACER CLIC AL BOTÓN ABAJO 2 VECES",4]
[null,null,null,null,8,"HACER CLIC AL BOTÓN ABAJO 3 VECES",5]
[null,null,null,null,8,"HACER CLIC AL BOTÓN ABAJO 4 VECES",6]
[null,null,null,null,8,"HACER CLIC AL BOTÓN ABAJO 5 VECES",7]
[null,null,null,null,8,"HACER CLIC AL BOTÓN ABAJO 6 VECES",8]
[null,null,null,null,null,"HACER CLIC AL BOTÓN ABAJO 7 VECES",9]
[null,null,null,null,8,"HACER CLIC AL BOTÓN ABAJO 8 VECES",10]
[null,null,null,null,9,"SAN JUAN BAUTISTA",1]
[null,null,null,null,9,"HACER CLIC AL BOTÓN ABAJO 1 VEZ",2]
[null,null,null,null,9,"HACER CLIC AL BOTÓN ABAJO 2 VECES",3]
[null,null,null,null,9,"HACER CLIC AL BOTÓN ABAJO 3 VECES",4]
[null,null,null,null,9,"HACER CLIC AL BOTÓN ABAJO 4 VECES",5]
[null,null,null,null,9,"HACER CLIC AL BOTÓN ABAJO 5 VECES",6]
[null,null,null,null,9,"HACER CLIC AL BOTÓN ABAJO 6 VECES",7]
[null,null,null,null,9,"HACER CLIC AL BOTÓN ABAJO 7 VECES",8]
[null,null,null,null,null,"HACER CLIC AL BOTÓN ABAJO 8 VECES",9]
[null,null,null,null,9,"HACER CLIC AL BOTÓN ABAJO 9 VECES",10]
[null,null,null,null,10,"PARAGUARÍ",1]
[null,null,null,null,10,"QUIINDY",2]
[null,null,null,null,10,"HACER CLIC AL BOTÓN ABAJO 1 VEZ",3]
[null,null,null,null,10,"HACER CLIC AL BOTÓN ABAJO 2 VECES",4]
[null,null,null,null,10,"HACER CLIC AL BOTÓN ABAJO 3 VECES",5]
[null,null,null,null,10,"HACER CLIC AL BOTÓN ABAJO 4 VECES",6]
[null,null,null,null,10,"HACER CLIC AL BOTÓN ABAJO 5 VECES",7]
[null,null,null,null,10,"HACER CLIC AL BOTÓN ABAJO 6 VECES",8]
[null,null,null,null,10,"HACER CLIC AL BOTÓN ABAJO 7 VECES",9]
[null,null,null,null,10,"HACER CLIC AL BOTÓN ABAJO 8 VECES",10]
[null,null,null,null,11,"CAAZAPÁ",1]
[null,null,null,null,11,"SAN JUAN NEPOMUCENO",2]
[null,null,null,null,11,"YUTY",3]
[null,null,null,null,11,"HACER CLIC AL BOTÓN ABAJO 1 VEZ",4]
[null,null,null,null,11,"HACER CLIC AL BOTÓN ABAJO 2 VECES",5]
[null,null,null,null,11,"HACER CLIC AL BOTÓN ABAJO 3 VECES",6]
[null,null,null,null,11,"HACER CLIC AL BOTÓN ABAJO 4 VECES",7]
[null,null,null,null,11,"HACER CLIC AL BOTÓN ABAJO 5 VECES",8]
[null,null,null,null,11,"HACER CLIC AL BOTÓN ABAJO 6 VECES",9]
[null,null,null,null,11,"HACER CLIC AL BOTÓN ABAJO 7 VECES",10]
[null,null,null,null,12,"SAN ESTANISLAO",1]
[null,null,null,null,12,"SAN PEDRO DE YCUAMANDYYÚ",2]
[null,null,null,null,12,"SANTA ROSA DEL AGUARAY",3]
[null,null,null,null,12,"HACER CLIC AL BOTÓN ABAJO 1 VEZ",4]
[null,null,null,null,12,"HACER CLIC AL BOTÓN ABAJO 2 VECES",5]
[null,null,null,null,12,"HACER CLIC AL BOTÓN ABAJO 3 VECES",6]
[null,null,null,null,12,"HACER CLIC AL BOTÓN ABAJO 4 VECES",7]
[null,null,null,null,12,"HACER CLIC AL BOTÓN ABAJO 5 VECES",8]
[null,null,null,null,12,"HACER CLIC AL BOTÓN ABAJO 6 VECES",9]
[null,null,null,null,12,"HACER CLIC AL BOTÓN ABAJO 7 VECES",10]
[null,null,null,null,13,"CAACUPÉ",1]
[null,null,null,null,13,"HACER CLIC AL BOTÓN ABAJO 1 VEZ",2]
[null,null,null,null,13,"HACER CLIC AL BOTÓN ABAJO 2 VECES",3]
[null,null,null,null,13,"HACER CLIC AL BOTÓN ABAJO 3 VECES",4]
[null,null,null,null,13,"HACER CLIC AL BOTÓN ABAJO 4 VECES",5]
[null,null,null,null,13,"HACER CLIC AL BOTÓN ABAJO 5 VECES",6]
[null,null,null,null,13,"HACER CLIC AL BOTÓN ABAJO 6 VECES",7]
[null,null,null,null,13,"HACER CLIC AL BOTÓN ABAJO 7 VECES",8]
[null,null,null,null,13,"HACER CLIC AL BOTÓN ABAJO 8 VECES",9]
[null,null,null,null,13,"HACER CLIC AL BOTÓN ABAJO 9 VECES",10]
[null,null,null,null,14,"VILLA HAYES",1]
[null,null,null,null,14,"HACER CLIC AL BOTÓN ABAJO 1 VEZ",2]
[null,null,null,null,14,"HACER CLIC AL BOTÓN ABAJO 2 VECES",3]
[null,null,null,null,14,"HACER CLIC AL BOTÓN ABAJO 3 VECES",4]
[null,null,null,null,14,"HACER CLIC AL BOTÓN ABAJO 4 VECES",5]
[null,null,null,null,14,"HACER CLIC AL BOTÓN ABAJO 5 VECES",6]
[null,null,null,null,14,"HACER CLIC AL BOTÓN ABAJO 6 VECES",7]
[null,null,null,null,14,"HACER CLIC AL BOTÓN ABAJO 7 VECES",8]
[null,null,null,null,14,"HACER CLIC AL BOTÓN ABAJO 8 VECES",9]
[null,null,null,null,14,"HACER CLIC AL BOTÓN ABAJO 9 VECES",10]
[null,null,null,null,15,"CURUGUATY",1]
[null,null,null,null,15,"SALTOS DEL GUAIRÁ",2]
[null,null,null,null,15,"KATUETÉ",3]
[null,null,null,null,15,"HACER CLIC AL BOTÓN ABAJO 1 VEZ",4]
[null,null,null,null,15,"HACER CLIC AL BOTÓN ABAJO 2 VECES",5]
[null,null,null,null,15,"HACER CLIC AL BOTÓN ABAJO 3 VECES",6]
[null,null,null,null,15,"HACER CLIC AL BOTÓN ABAJO 4 VECES",7]
[null,null,null,null,15,"HACER CLIC AL BOTÓN ABAJO 5 VECES",8]
[null,null,null,null,15,"HACER CLIC AL BOTÓN ABAJO 6 VECES",9]
[null,null,null,null,15,"HACER CLIC AL BOTÓN ABAJO 7 VECES",10]
[null,null,null,null,16,"CAPIATÁ",1]
[null,null,null,null,16,"FERNANDO DE LA MORA",2]
[null,null,null,null,16,"JULIÁN AUGUSTO SALDÍVAR ",3]
[null,null,null,null,16,"LAMBARÉ",4]
[null,null,null,null,16,"LUQUE ",5]
[null,null,null,null,16,"SAN LORENZO ",6]
[null,null,null,null,16,"HACER CLIC AL BOTÓN ABAJO 1 VEZ",7]
[null,null,null,null,16,"HACER CLIC AL BOTÓN ABAJO 2 VECES",8]
[null,null,null,null,16,"HACER CLIC AL BOTÓN ABAJO 3 VECES",9]
[null,null,null,null,16,"HACER CLIC AL BOTÓN ABAJO 4 VECES",10]
[null,null,null,null,17,"FILADELFIA",1]
[null,null,null,null,17,"MARISCAL ESTIGARRIBIA",2]
[null,null,null,null,17,"NEULAND",3]
[null,null,null,null,17,"HACER CLIC AL BOTÓN ABAJO 1 VEZ",4]
[null,null,null,null,17,"HACER CLIC AL BOTÓN ABAJO 2 VECES",5]
[null,null,null,null,17,"HACER CLIC AL BOTÓN ABAJO 3 VECES",6]
[null,null,null,null,17,"HACER CLIC AL BOTÓN ABAJO 4 VECES",7]
[null,null,null,null,17,"HACER CLIC AL BOTÓN ABAJO 5 VECES",8]
[null,null,null,null,17,"HACER CLIC AL BOTÓN ABAJO 6 VECES",9]
[null,null,null,null,17,"HACER CLIC AL BOTÓN ABAJO 7 VECES",10]
[null,null,null,null,18,"BAHÍA NEGRA",1]
[null,null,null,null,18,"CARMELO PERALTA",2]
[null,null,null,null,18,"FUERTE OLIMPO",3]
[null,null,null,null,18,"PUERTO CASADO",4]
[null,null,null,null,18,"HACER CLIC AL BOTÓN ABAJO 1 VEZ",5]
[null,null,null,null,18,"HACER CLIC AL BOTÓN ABAJO 2 VECES",6]
[null,null,null,null,18,"HACER CLIC AL BOTÓN ABAJO 3 VECES",7]
[null,null,null,null,18,"HACER CLIC AL BOTÓN ABAJO 4 VECES",8]
[null,null,null,null,18,"HACER CLIC AL BOTÓN ABAJO 5 VECES",9]
[null,null,null,null,18,"HACER CLIC AL BOTÓN ABAJO 6 VECES",10]