{"text_format":"1","workbook":"xlsx","n_sheets":2,"sheets":["1° INST. PENAL - PG_PS","DATOS"],"not_rendered":{"charts":0,"images":0,"macros":1,"external_links":2,"defined_names":19,"comments":0,"pivot_tables":0},"unopened":[],"bounds":{"document_bytes":16777216,"sheet_cells":100000,"rows_first":2000,"rows_last":500,"rows_between":2000,"halvings":0,"cell_chars":16384,"cell_head_chars":4096},"cells_cut":0,"cells_raw":0,"read":"whole","date_system":"1900"}

{"sheet":"1° INST. PENAL - PG_PS","index":0,"n_rows":1012,"n_cols":13,"rows_kept":1012,"cut":false,"hidden":false,"merged":[[2,0,2,1],[2,2,2,9],[8,0,8,1],[7,0,7,1],[6,0,6,1],[5,0,5,1],[4,0,4,1],[3,0,3,1],[3,2,3,9],[4,2,4,9],[5,2,5,9],[9,2,9,5],[8,2,8,5],[7,2,7,5],[6,2,6,5],[1007,6,1007,7],[1007,8,1007,9],[992,6,992,7],[992,8,992,9],[987,6,987,7],[987,8,987,9],[982,6,982,7],[982,8,982,9],[977,6,977,7],[977,8,977,9],[972,6,972,7],[972,8,972,9],[967,6,967,7],[967,8,967,9],[962,6,962,7],[962,8,962,9],[957,6,957,7],[1007,10,1007,11],[1007,12,1007,13],[1006,6,1006,7],[1006,8,1006,9],[1006,10,1006,11],[1006,12,1006,13],[997,6,997,7],[997,8,997,9],[997,10,997,11],[997,12,997,13],[998,6,998,7],[998,8,998,9],[998,10,998,11],[998,12,998,13],[999,6,999,7],[999,8,999,9],[999,10,999,11],[999,12,999,13],[1000,6,1000,7],[1000,8,1000,9],[1000,10,1000,11],[1000,12,1000,13],[1001,6,1001,7],[1001,8,1001,9],[1001,10,1001,11],[1001,12,1001,13],[1008,6,1008,7],[1008,8,1008,9],[1008,10,1008,11],[1008,12,1008,13],[1009,6,1009,7],[1009,8,1009,9],[1009,10,1009,11],[1009,12,1009,13],[1010,6,1010,7],[1010,8,1010,9],[1010,10,1010,11],[1010,12,1010,13],[1011,6,1011,7],[1011,8,1011,9],[1011,10,1011,11],[1011,12,1011,13],[1002,6,1002,7],[1002,8,1002,9],[1002,10,1002,11],[1002,12,1002,13],[1003,6,1003,7],[1003,8,1003,9],[1003,10,1003,11],[1003,12,1003,13],[1004,6,1004,7],[1004,8,1004,9],[1004,10,1004,11],[1004,12,1004,13],[1005,6,1005,7],[1005,8,1005,9],[1005,10,1005,11],[1005,12,1005,13],[992,10,992,11],[992,12,992,13],[993,6,993,7],[993,8,993,9],[993,10,993,11],[993,12,993,13],[994,6,994,7],[994,8,994,9],[994,10,994,11],[994,12,994,13],[995,6,995,7],[995,8,995,9],[995,10,995,11],[995,12,995,13],[996,6,996,7],[996,8,996,9],[996,10,996,11],[996,12,996,13],[987,10,987,11],[987,12,987,13],[988,6,988,7],[988,8,988,9],[988,10,988,11],[988,12,988,13],[989,6,989,7],[989,8,989,9],[989,10,989,11],[989,12,989,13],[990,6,990,7],[990,8,990,9],[990,10,990,11],[990,12,990,13],[991,6,991,7],[991,8,991,9],[991,10,991,11],[991,12,991,13],[982,10,982,11],[982,12,982,13],[983,6,983,7],[983,8,983,9],[983,10,983,11],[983,12,983,13],[984,6,984,7],[984,8,984,9],[984,10,984,11],[984,12,984,13],[985,6,985,7],[985,8,985,9],[985,10,985,11],[985,12,985,13],[986,6,986,7],[986,8,986,9],[986,10,986,11],[986,12,986,13],[977,10,977,11],[977,12,977,13],[978,6,978,7],[978,8,978,9],[978,10,978,11],[978,12,978,13],[979,6,979,7],[979,8,979,9],[979,10,979,11],[979,12,979,13],[980,6,980,7],[980,8,980,9],[980,10,980,11],[980,12,980,13],[981,6,981,7],[981,8,981,9],[981,10,981,11],[981,12,981,13],[972,10,972,11],[972,12,972,13],[973,6,973,7],[973,8,973,9],[973,10,973,11],[973,12,973,13],[974,6,974,7],[974,8,974,9],[974,10,974,11],[974,12,974,13],[975,6,975,7],[975,8,975,9],[975,10,975,11],[975,12,975,13],[976,6,976,7],[976,8,976,9],[976,10,976,11],[976,12,976,13],[967,10,967,11],[967,12,967,13],[968,6,968,7],[968,8,968,9],[968,10,968,11],[968,12,968,13],[969,6,969,7],[969,8,969,9],[969,10,969,11],[969,12,969,13],[970,6,970,7],[970,8,970,9],[970,10,970,11],[970,12,970,13],[971,6,971,7],[971,8,971,9],[971,10,971,11],[971,12,971,13],[962,10,962,11],[962,12,962,13],[963,6,963,7],[963,8,963,9],[963,10,963,11],[963,12,963,13],[964,6,964,7],[964,8,964,9],[964,10,964,11],[964,12,964,13],[965,6,965,7],[965,8,965,9],[965,10,965,11],[965,12,965,13],[966,6,966,7],[966,8,966,9],[966,10,966,11],[966,12,966,13],[957,8,957,9],[957,10,957,11],[957,12,957,13],[958,6,958,7],[958,8,958,9],[958,10,958,11],[958,12,958,13],[959,6,959,7],[959,8,959,9],[959,10,959,11],[959,12,959,13],[960,6,960,7],[960,8,960,9],[960,10,960,11],[960,12,960,13],[961,6,961,7],[961,8,961,9],[961,10,961,11],[961,12,961,13],[952,6,952,7],[952,8,952,9],[952,10,952,11],[952,12,952,13],[953,6,953,7],[953,8,953,9],[953,10,953,11],[953,12,953,13],[954,6,954,7],[954,8,954,9],[954,10,954,11],[954,12,954,13],[955,6,955,7],[955,8,955,9],[955,10,955,11],[955,12,955,13],[956,6,956,7],[956,8,956,9],[956,10,956,11],[956,12,956,13],[947,6,947,7],[947,8,947,9],[947,10,947,11],[947,12,947,13],[948,6,948,7],[948,8,948,9],[948,10,948,11],[948,12,948,13],[949,6,949,7],[949,8,949,9],[949,10,949,11],[949,12,949,13],[950,6,950,7],[950,8,950,9],[950,10,950,11],[950,12,950,13],[951,6,951,7],[951,8,951,9],[951,10,951,11],[951,12,951,13],[942,6,942,7],[942,8,942,9],[942,10,942,11],[942,12,942,13],[943,6,943,7],[943,8,943,9],[943,10,943,11],[943,12,943,13],[944,6,944,7],[944,8,944,9],[944,10,944,11],[944,12,944,13],[945,6,945,7],[945,8,945,9],[945,10,945,11],[945,12,945,13],[946,6,946,7],[946,8,946,9],[946,10,946,11],[946,12,946,13],[937,6,937,7],[937,8,937,9],[937,10,937,11],[937,12,937,13],[938,6,938,7],[938,8,938,9],[938,10,938,11],[938,12,938,13],[939,6,939,7],[939,8,939,9],[939,10,939,11],[939,12,939,13],[940,6,940,7],[940,8,940,9],[940,10,940,11],[940,12,940,13],[941,6,941,7],[941,8,941,9],[941,10,941,11],[941,12,941,13],[932,6,932,7],[932,8,932,9],[932,10,932,11],[932,12,932,13],[933,6,933,7],[933,8,933,9],[933,10,933,11],[933,12,933,13],[934,6,934,7],[934,8,934,9],[934,10,934,11],[934,12,934,13],[935,6,935,7],[935,8,935,9],[935,10,935,11],[935,12,935,13],[936,6,936,7],[936,8,936,9],[936,10,936,11],[936,12,936,13],[927,6,927,7],[927,8,927,9],[927,10,927,11],[927,12,927,13],[928,6,928,7],[928,8,928,9],[928,10,928,11],[928,12,928,13],[929,6,929,7],[929,8,929,9],[929,10,929,11],[929,12,929,13],[930,6,930,7],[930,8,930,9],[930,10,930,11],[930,12,930,13],[931,6,931,7],[931,8,931,9],[931,10,931,11],[931,12,931,13],[922,6,922,7],[922,8,922,9],[922,10,922,11],[922,12,922,13],[923,6,923,7],[923,8,923,9],[923,10,923,11],[923,12,923,13],[924,6,924,7],[924,8,924,9],[924,10,924,11],[924,12,924,13],[925,6,925,7],[925,8,925,9],[925,10,925,11],[925,12,925,13],[926,6,926,7],[926,8,926,9],[926,10,926,11],[926,12,926,13],[917,6,917,7],[917,8,917,9],[917,10,917,11],[917,12,917,13],[918,6,918,7],[918,8,918,9],[918,10,918,11],[918,12,918,13],[919,6,919,7],[919,8,919,9],[919,10,919,11],[919,12,919,13],[920,6,920,7],[920,8,920,9],[920,10,920,11],[920,12,920,13],[921,6,921,7],[921,8,921,9],[921,10,921,11],[921,12,921,13],[912,6,912,7],[912,8,912,9],[912,10,912,11],[912,12,912,13],[913,6,913,7],[913,8,913,9],[913,10,913,11],[913,12,913,13],[914,6,914,7],[914,8,914,9],[914,10,914,11],[914,12,914,13],[915,6,915,7],[915,8,915,9],[915,10,915,11],[915,12,915,13],[916,6,916,7],[916,8,916,9],[916,10,916,11],[916,12,916,13],[907,6,907,7],[907,8,907,9],[907,10,907,11],[907,12,907,13],[908,6,908,7],[908,8,908,9],[908,10,908,11],[908,12,908,13],[909,6,909,7],[909,8,909,9],[909,10,909,11],[909,12,909,13],[910,6,910,7],[910,8,910,9],[910,10,910,11],[910,12,910,13],[911,6,911,7],[911,8,911,9],[911,10,911,11],[911,12,911,13],[902,6,902,7],[902,8,902,9],[902,10,902,11],[902,12,902,13],[903,6,903,7],[903,8,903,9],[903,10,903,11],[903,12,903,13],[904,6,904,7],[904,8,904,9],[904,10,904,11],[904,12,904,13],[905,6,905,7],[905,8,905,9],[905,10,905,11],[905,12,905,13],[906,6,906,7],[906,8,906,9],[906,10,906,11],[906,12,906,13],[897,6,897,7],[897,8,897,9],[897,10,897,11],[897,12,897,13],[898,6,898,7],[898,8,898,9],[898,10,898,11],[898,12,898,13],[899,6,899,7],[899,8,899,9],[899,10,899,11],[899,12,899,13],[900,6,900,7],[900,8,900,9],[900,10,900,11],[900,12,900,13],[901,6,901,7],[901,8,901,9],[901,10,901,11],[901,12,901,13],[892,6,892,7],[892,8,892,9],[892,10,892,11],[892,12,892,13],[893,6,893,7],[893,8,893,9],[893,10,893,11],[893,12,893,13],[894,6,894,7],[894,8,894,9],[894,10,894,11],[894,12,894,13],[895,6,895,7],[895,8,895,9],[895,10,895,11],[895,12,895,13],[896,6,896,7],[896,8,896,9],[896,10,896,11],[896,12,896,13],[887,6,887,7],[887,8,887,9],[887,10,887,11],[887,12,887,13],[888,6,888,7],[888,8,888,9],[888,10,888,11],[888,12,888,13],[889,6,889,7],[889,8,889,9],[889,10,889,11],[889,12,889,13],[890,6,890,7],[890,8,890,9],[890,10,890,11],[890,12,890,13],[891,6,891,7],[891,8,891,9],[891,10,891,11],[891,12,891,13],[882,6,882,7],[882,8,882,9],[882,10,882,11],[882,12,882,13],[883,6,883,7],[883,8,883,9],[883,10,883,11],[883,12,883,13],[884,6,884,7],[884,8,884,9],[884,10,884,11],[884,12,884,13],[885,6,885,7],[885,8,885,9],[885,10,885,11],[885,12,885,13],[886,6,886,7],[886,8,886,9],[886,10,886,11],[886,12,886,13],[877,6,877,7],[877,8,877,9],[877,10,877,11],[877,12,877,13],[878,6,878,7],[878,8,878,9],[878,10,878,11],[878,12,878,13],[879,6,879,7],[879,8,879,9],[879,10,879,11],[879,12,879,13],[880,6,880,7],[880,8,880,9],[880,10,880,11],[880,12,880,13],[881,6,881,7],[881,8,881,9],[881,10,881,11],[881,12,881,13],[872,6,872,7],[872,8,872,9],[872,10,872,11],[872,12,872,13],[873,6,873,7],[873,8,873,9],[873,10,873,11],[873,12,873,13],[874,6,874,7],[874,8,874,9],[874,10,874,11],[874,12,874,13],[875,6,875,7],[875,8,875,9],[875,10,875,11],[875,12,875,13],[876,6,876,7],[876,8,876,9],[876,10,876,11],[876,12,876,13],[867,6,867,7],[867,8,867,9],[867,10,867,11],[867,12,867,13],[868,6,868,7],[868,8,868,9],[868,10,868,11],[868,12,868,13],[869,6,869,7],[869,8,869,9],[869,10,869,11],[869,12,869,13],[870,6,870,7],[870,8,870,9],[870,10,870,11],[870,12,870,13],[871,6,871,7],[871,8,871,9],[871,10,871,11],[871,12,871,13],[862,6,862,7],[862,8,862,9],[862,10,862,11],[862,12,862,13],[863,6,863,7],[863,8,863,9],[863,10,863,11],[863,12,863,13],[864,6,864,7],[864,8,864,9],[864,10,864,11],[864,12,864,13],[865,6,865,7],[865,8,865,9],[865,10,865,11],[865,12,865,13],[866,6,866,7],[866,8,866,9],[866,10,866,11],[866,12,866,13],[857,6,857,7],[857,8,857,9],[857,10,857,11],[857,12,857,13],[858,6,858,7],[858,8,858,9],[858,10,858,11],[858,12,858,13],[859,6,859,7],[859,8,859,9],[859,10,859,11],[859,12,859,13],[860,6,860,7],[860,8,860,9],[860,10,860,11],[860,12,860,13],[861,6,861,7],[861,8,861,9],[861,10,861,11],[861,12,861,13],[852,6,852,7],[852,8,852,9],[852,10,852,11],[852,12,852,13],[853,6,853,7],[853,8,853,9],[853,10,853,11],[853,12,853,13],[854,6,854,7],[854,8,854,9],[854,10,854,11],[854,12,854,13],[855,6,855,7],[855,8,855,9],[855,10,855,11],[855,12,855,13],[856,6,856,7],[856,8,856,9],[856,10,856,11],[856,12,856,13],[847,6,847,7],[847,8,847,9],[847,10,847,11],[847,12,847,13],[848,6,848,7],[848,8,848,9],[848,10,848,11],[848,12,848,13],[849,6,849,7],[849,8,849,9],[849,10,849,11],[849,12,849,13],[850,6,850,7],[850,8,850,9],[850,10,850,11],[850,12,850,13],[851,6,851,7],[851,8,851,9],[851,10,851,11],[851,12,851,13],[842,6,842,7],[842,8,842,9],[842,10,842,11],[842,12,842,13],[843,6,843,7],[843,8,843,9],[843,10,843,11],[843,12,843,13],[844,6,844,7],[844,8,844,9],[844,10,844,11],[844,12,844,13],[845,6,845,7],[845,8,845,9],[845,10,845,11],[845,12,845,13],[846,6,846,7],[846,8,846,9],[846,10,846,11],[846,12,846,13],[837,6,837,7],[837,8,837,9],[837,10,837,11],[837,12,837,13],[838,6,838,7],[838,8,838,9],[838,10,838,11],[838,12,838,13],[839,6,839,7],[839,8,839,9],[839,10,839,11],[839,12,839,13],[840,6,840,7],[840,8,840,9],[840,10,840,11],[840,12,840,13],[841,6,841,7],[841,8,841,9],[841,10,841,11],[841,12,841,13],[832,6,832,7],[832,8,832,9],[832,10,832,11],[832,12,832,13],[833,6,833,7],[833,8,833,9],[833,10,833,11],[833,12,833,13],[834,6,834,7],[834,8,834,9],[834,10,834,11],[834,12,834,13],[835,6,835,7],[835,8,835,9],[835,10,835,11],[835,12,835,13],[836,6,836,7],[836,8,836,9],[836,10,836,11],[836,12,836,13],[827,6,827,7],[827,8,827,9],[827,10,827,11],[827,12,827,13],[828,6,828,7],[828,8,828,9],[828,10,828,11],[828,12,828,13],[829,6,829,7],[829,8,829,9],[829,10,829,11],[829,12,829,13],[830,6,830,7],[830,8,830,9],[830,10,830,11],[830,12,830,13],[831,6,831,7],[831,8,831,9],[831,10,831,11],[831,12,831,13],[822,6,822,7],[822,8,822,9],[822,10,822,11],[822,12,822,13],[823,6,823,7],[823,8,823,9],[823,10,823,11],[823,12,823,13],[824,6,824,7],[824,8,824,9],[824,10,824,11],[824,12,824,13],[825,6,825,7],[825,8,825,9],[825,10,825,11],[825,12,825,13],[826,6,826,7],[826,8,826,9],[826,10,826,11],[826,12,826,13],[817,6,817,7],[817,8,817,9],[817,10,817,11],[817,12,817,13],[818,6,818,7],[818,8,818,9],[818,10,818,11],[818,12,818,13],[819,6,819,7],[819,8,819,9],[819,10,819,11],[819,12,819,13],[820,6,820,7],[820,8,820,9],[820,10,820,11],[820,12,820,13],[821,6,821,7],[821,8,821,9],[821,10,821,11],[821,12,821,13],[812,6,812,7],[812,8,812,9],[812,10,812,11],[812,12,812,13],[813,6,813,7],[813,8,813,9],[813,10,813,11],[813,12,813,13],[814,6,814,7],[814,8,814,9],[814,10,814,11],[814,12,814,13],[815,6,815,7],[815,8,815,9],[815,10,815,11],[815,12,815,13],[816,6,816,7],[816,8,816,9],[816,10,816,11],[816,12,816,13],[807,6,807,7],[807,8,807,9],[807,10,807,11],[807,12,807,13],[808,6,808,7],[808,8,808,9],[808,10,808,11],[808,12,808,13],[809,6,809,7],[809,8,809,9],[809,10,809,11],[809,12,809,13],[810,6,810,7],[810,8,810,9],[810,10,810,11],[810,12,810,13],[811,6,811,7],[811,8,811,9],[811,10,811,11],[811,12,811,13],[802,6,802,7],[802,8,802,9],[802,10,802,11],[802,12,802,13],[803,6,803,7],[803,8,803,9],[803,10,803,11],[803,12,803,13],[804,6,804,7],[804,8,804,9],[804,10,804,11],[804,12,804,13],[805,6,805,7],[805,8,805,9],[805,10,805,11],[805,12,805,13],[806,6,806,7],[806,8,806,9],[806,10,806,11],[806,12,806,13],[797,6,797,7],[797,8,797,9],[797,10,797,11],[797,12,797,13],[798,6,798,7],[798,8,798,9],[798,10,798,11],[798,12,798,13],[799,6,799,7],[799,8,799,9],[799,10,799,11],[799,12,799,13],[800,6,800,7],[800,8,800,9],[800,10,800,11],[800,12,800,13],[801,6,801,7],[801,8,801,9],[801,10,801,11],[801,12,801,13],[792,6,792,7],[792,8,792,9],[792,10,792,11],[792,12,792,13],[793,6,793,7],[793,8,793,9],[793,10,793,11],[793,12,793,13],[794,6,794,7],[794,8,794,9],[794,10,794,11],[794,12,794,13],[795,6,795,7],[795,8,795,9],[795,10,795,11],[795,12,795,13],[796,6,796,7],[796,8,796,9],[796,10,796,11],[796,12,796,13],[787,6,787,7],[787,8,787,9],[787,10,787,11],[787,12,787,13],[788,6,788,7],[788,8,788,9],[788,10,788,11],[788,12,788,13],[789,6,789,7],[789,8,789,9],[789,10,789,11],[789,12,789,13],[790,6,790,7],[790,8,790,9],[790,10,790,11],[790,12,790,13],[791,6,791,7],[791,8,791,9],[791,10,791,11],[791,12,791,13],[782,6,782,7],[782,8,782,9],[782,10,782,11],[782,12,782,13],[783,6,783,7],[783,8,783,9],[783,10,783,11],[783,12,783,13],[784,6,784,7],[784,8,784,9],[784,10,784,11],[784,12,784,13],[785,6,785,7],[785,8,785,9],[785,10,785,11],[785,12,785,13],[786,6,786,7],[786,8,786,9],[786,10,786,11],[786,12,786,13],[777,6,777,7],[777,8,777,9],[777,10,777,11],[777,12,777,13],[778,6,778,7],[778,8,778,9],[778,10,778,11],[778,12,778,13],[779,6,779,7],[779,8,779,9],[779,10,779,11],[779,12,779,13],[780,6,780,7],[780,8,780,9],[780,10,780,11],[780,12,780,13],[781,6,781,7],[781,8,781,9],[781,10,781,11],[781,12,781,13],[772,6,772,7],[772,8,772,9],[772,10,772,11],[772,12,772,13],[773,6,773,7],[773,8,773,9],[773,10,773,11],[773,12,773,13],[774,6,774,7],[774,8,774,9],[774,10,774,11],[774,12,774,13],[775,6,775,7],[775,8,775,9],[775,10,775,11],[775,12,775,13],[776,6,776,7],[776,8,776,9],[776,10,776,11],[776,12,776,13],[767,6,767,7],[767,8,767,9],[767,10,767,11],[767,12,767,13],[768,6,768,7],[768,8,768,9],[768,10,768,11],[768,12,768,13],[769,6,769,7],[769,8,769,9],[769,10,769,11],[769,12,769,13],[770,6,770,7],[770,8,770,9],[770,10,770,11],[770,12,770,13],[771,6,771,7],[771,8,771,9],[771,10,771,11],[771,12,771,13],[762,6,762,7],[762,8,762,9],[762,10,762,11],[762,12,762,13],[763,6,763,7]],"merged_total":4036,"flags":["merged_cut"]}
["JUZGADOS DE PRIMERA INSTANCIA MONO FUERO PENAL DE LA REPÚBLICA DEL PARAGUAY"]
["APLICA PARA LAS ETAPAS DE GARANTÍAS O DE SENTENCIA "]
["CIRCUNSCRIPCIÓN JUDICIAL: ",null,{"$f":"IF(DATOS!H7=0,\"SELECCIONE SU CIRCUNSCRIPCIÓN----->\",IF(DATOS!H7=1,\"1° CAPITAL\",IF(DATOS!H7=2,\"2° GUAIRÁ\",IF(DATOS!H7=3,\"3° ITAPÚA\",IF(DATOS!H7=4,\"4° CONCEPCIÓN\",IF(DATOS!H7=5,\"5°AMAMBAY\",IF(DATOS!H7=6,\"6° ALTO PARANÁ\",IF(DATOS!H7=7,\"7° CAAGUAZÚ\",IF(DATOS!H7=8,\" 8° ÑEEMBUCÚ\",IF(DATOS!H7=9,\" 9° MISIONES\",IF(DATOS!H7=10,\"10° PARAGUARÍ\",IF(DATOS!H7=11,\"11° CAAZAPÁ\",IF(DATOS!H7=12,\"12° SAN PEDRO\",IF(DATOS!H7=13,\"13° CORDILLERA\",IF(DATOS!H7=14,\"14° PRESIDENTE HAYES\",IF(DATOS!H7=15,\"15° CANINDEYÚ\",IF(DATOS!H7=16,\"16° CENTRAL\",IF(DATOS!H7=17,\"17° BOQUERÓN\",IF(DATOS!H7=18,\"18° ALTO PARAGUAY\")))))))))))))))))))","v":"SELECCIONE SU CIRCUNSCRIPCIÓN----->"},null,null,null,null,null,null,null,"AÑO:",null,"INGRESE FECHA DE CORTE"]
["CIUDAD:",null,{"$f":"IF(DATOS!H7=0,\"SELECCIONE PRIMERO SU CIRCUNSCRIPCIÓN\",IF(DATOS!H34=0,\"SELECCIONE SU CIUDAD---->\",DATOS!H37))","v":"SELECCIONE PRIMERO SU CIRCUNSCRIPCIÓN"},null,null,null,null,null,null,null,"PERIODO - CUATRIMESTRE",null,"1° CUATRIMESTRE "]
["JUZGADO DE PRIMERA INSTANCIA: ",null,{"$f":"IF(DATOS!F12=0,\"SELECCIONE SU JUZGADO----->\",IF(DATOS!F12=1,DATOS!D36,IF(DATOS!F12=2,DATOS!D37,IF(DATOS!F12=3,DATOS!D38,IF(DATOS!F12=4,DATOS!D39,IF(DATOS!F12=5,DATOS!D40,IF(DATOS!F12=6,DATOS!D41,IF(DATOS!F12=7,DATOS!D42,IF(DATOS!F12=8,DATOS!D43,IF(DATOS!F12=9,DATOS!D44,IF(DATOS!F12=10,DATOS!D45,IF(DATOS!F12=11,DATOS!D46,IF(DATOS!F12=12,DATOS!D47,IF(DATOS!F12=13,DATOS!D48))))))))))))))","v":"SELECCIONE SU JUZGADO----->"}]
["NÚMERO:",null,{"$f":"IF(DATOS!H13=0,\"SELECCIONE SU NÚMERO----->\",IF(DATOS!H13=1,\"UT\",IF(DATOS!H13=2,\"N1\",IF(DATOS!H13=3,\"N1A\",IF(DATOS!H13=4,\"N1B\",IF(DATOS!H13=5,\"N1C\",IF(DATOS!H13=6,\"N2\",IF(DATOS!H13=7,\"N2A\",IF(DATOS!H13=8,\"N2B\",IF(DATOS!H13=9,\"N2C\",IF(DATOS!H13=10,\"N2-N6\",IF(DATOS!H13=11,\"N3\",IF(DATOS!H13=12,\"N3A\",IF(DATOS!H13=13,\"N3B\",IF(DATOS!H13=14,\"N3C\",IF(DATOS!H13=15,\"N4\",IF(DATOS!H13=16,\"N4A\",IF(DATOS!H13=17,\"N4B\",IF(DATOS!H13=18,\"N4C\",IF(DATOS!H13=19,\"N5\",IF(DATOS!H13=20,\"N5A\",IF(DATOS!H13=21,\"N5B\",IF(DATOS!H13=22,\"N5C\",IF(DATOS!H13=23,\"N6\",IF(DATOS!H13=24,\"N7\",IF(DATOS!H13=25,\"N8\",IF(DATOS!H13=26,\"N9\",IF(DATOS!H13=27,\"N10\",IF(DATOS!H13=28,\"N11\",IF(DATOS!H13=29,\"N12\",IF(DATOS!H13=30,\"N13\",IF(DATOS!H13=31,\"N14\",IF(DATOS!H13=32,\"N15\",IF(DATOS!H13=33,\"N16\",IF(DATOS!H13=34,\"N17\",IF(DATOS!H13=35,\"N18\",IF(DATOS!H13=36,\"N19\",IF(DATOS!H13=37,\"N20\",IF(DATOS!H13=38,\"N21\",IF(DATOS!H13=39,\"N22\",IF(DATOS!H13=40,\"N23\",IF(DATOS!H13=41,\"N24\",IF(DATOS!H13=42,\"N25\",IF(DATOS!H13=43,\"N26\",IF(DATOS!H13=44,\"N27\",IF(DATOS!H13=45,\"N28\",IF(DATOS!H13=46,\"N29\",IF(DATOS!H13=47,\"N30\",IF(DATOS!H13=48,\"N31\",IF(DATOS!H13=49,\"N32\",IF(DATOS!H13=50,\"N33\",IF(DATOS!H13=51,\"N34\",IF(DATOS!H13=52,\"N35\",IF(DATOS!H13=53,\"N36\",IF(DATOS!H13=54,\"N37\",IF(DATOS!H13=55,\"N38\",IF(DATOS!H13=56,\"N39\",IF(DATOS!H13=57,\"N40\"))))))))))))))))))))))))))))))))))))))))))))))))))))))))))","v":"SELECCIONE SU NÚMERO----->"},null,null,null,null,null,null,null,null,null,"2° CUATRIMESTRE "]
["NOMBRE COMPLETO DEL MAGISTRADO/A: ",null,null,null,null,null,"VINCULACIÓN"]
["NOMBRE COMPLETO DEL ACTUARIO/A: ",null,null,null,null,null,"VINCULACIÓN",null,"SECRETARÍA N°:",null,null,null,"3° CUATRIMESTRE "]
["NOMBRE COMPLETO DEL ACTUARIO/A: ",null,null,null,null,null,"VINCULACIÓN",null,"SECRETARÍA N°:"]
["NOMBRE COMPLETO DEL ACTUARIO/A: ",null,null,null,null,null,"VINCULACIÓN",null,"SECRETARÍA N°:"]
["N°                            ITEM","CARÁTULA COMPLETA ","CAUSA N°","AÑO","ETAPA PROCESAL","PENDENCIA",null,null,"AUDIENCIA/S RE AGENDADA/S",null,"CANTIDAD ",null,"SECRETARIA N°"]
[null,null,null,null,null,"FECHA DE AUDIENCIA PENDIENTE","TIPO DE AUDIENCIA"]
[1]
[{"$f":"IF(B14<>\"\",A13+1,\"\")","v":""}]
[{"$f":"IF(B15<>\"\",A14+1,\"\")","v":""}]
[""]
[""]
[""]
[""]
[""]
[""]
[""]
[""]
[""]
[""]
[""]
[""]
[""]
[""]
[""]
[""]
[""]
[""]
[""]
[""]
[""]
[""]
[""]
[""]
[""]
[""]
[""]
[""]
[""]
[""]
[""]
[""]
[""]
[""]
[""]
[""]
[""]
[""]
[""]
[""]
[""]
[""]
[""]
[""]
[""]
[""]
[""]
[""]
[""]
[""]
[""]
[""]
[""]
[""]
[""]
[""]
[""]
[""]
[""]
[""]
[""]
[""]
[""]
[{"$f":"IF(B79<>\"\",A78+1,\"\")","v":""}]
[""]
{"$rows_left_out":933}
{"sheet":"DATOS","index":1,"n_rows":213,"n_cols":12,"rows_kept":213,"cut":false,"hidden":true,"merged":[[1,1,2,12],[16,5,16,7]]}
[]
[null,"VALIDACIONES DE LA PLANILLA DE PENDENCIA"]
[]
[]
[]
[null,null,null,"VINCULACIÓN",null,"TIPO AUDIENCIA",null,"SELEC / CIRCUNSP"]
[null,null,null,"TITULAR",null,"PRELIMINAR",null,0]
[null,null,null,"INTERINO/A",null,"J. O. y P."]
[null,null,null,"ITINERANTE",null,null,null,"MARQUE AQUI"]
[null,null,null,null,null,null,null,1]
[null,null,null,"AUDIENCIAS REAGENDADAS",null,"SELEC / FUERO"]
[null,null,null,"SÍ",null,0,null,"SELEC / TURNO"]
[null,null,null,"NO",null,null,null,0]
[]
[null,null,null,"ETAPA PROCESAL"]
[null,null,null,"GARANTÍAS "]
[null,null,null,"GARANTÍAS ORDINARIO CAPITAL",null,"FORMULA VALIDACIÓN EN PLANILLA"]
[null,null,null,"GARANTÍAS DE LA ADOLESCENCIA"]
[null,null,null,"GARANTÍAS DELITOS ECONÓMICOS Y CORRUPCIÓN CAPITAL"]
[null,null,null,"GARANTÍAS CRIMEN ORGANIZADO CAPITAL",null,"GARANTÍAS",null,"PRELIMINAR"]
[null,null,null,"SENTENCIA",null,"SENTENCIA",null,"J.O. y P.",null,null,"GARANTÍAS ","PRELIMINAR"]
[null,null,null,"SENTENCIA ORDINARIO CAPITAL",null,"LIQUIDACIÓN",null,"J.O. y P.",null,null,"GARANTÍAS ORDINARIO  CAPITAL","PRELIMINAR"]
[null,null,null,"SENTENCIA DELITOS ECONÓMICOS Y CORRUPCIÓN CAPITAL",null,null,null,null,null,null,"GARANTÍAS DE LA ADOLESCENCIA","PRELIMINAR"]
[null,null,null,"SENTENCIA CRIMEN ORGANIZADO CAPITAL",null,null,null,null,null,null,"GARANTÍAS DELITOS ECONÓMICOS Y CORRUPCIÓN - CAPITAL","PRELIMINAR"]
[null,null,null,null,null,null,null,{"$f":"IF(ISNUMBER(SEARCH(\"Garantías\",'1° INST. PENAL - PG_PS'!$E13)),\"Garantías\",IF(ISNUMBER(SEARCH(\"Sentencia\",'1° INST. PENAL - PG_PS'!$E13)),\"Sentencia\",IF(ISNUMBER(SEARCH(\"Liquidación\",'1° INST. PENAL - PG_PS'!$E13)),\"Liquidación; \"\"\")))","v":false},null,null,"GARANTÍAS CRIMEN ORGANIZADO - CAPITAL","PRELIMINAR"]
[null,null,null,null,null,null,null,null,null,null,"SENTENCIA","J.O. y P."]
[null,null,null,null,null,null,null,null,null,null,"SENTENCIA ORDINARIO - CAPITAL","J.O. y P."]
[null,null,null,"VINCULACIÓN",null,null,null,null,null,null,"SENTENCIA DELITOS ECONÓMICOS Y CORRUPCIÓN - CAPITAL","J.O. y P."]
[null,null,null,"TITULAR",null,null,null,"PRELIMINAR",null,null,"SENTENCIA CRIMEN ORGANIZADO - CAPITAL","J.O. y P."]
[null,null,null,"INTERINO/A",null,null,null,"J.O. y. P.",null,null,"Liquidación y Sentencia","J.O. y P."]
[null,null,null,"COMISIONADO/A"]
[]
[null,null,null,null,"N°","LOCALIDAD / CIUDAD","Columna1","SELEC / CIUDAD"]
[null,null,null,null,1,"ASUNCIÓN",1,0]
[null,null,null,"JUZGADO DE PRIMERA INSTANCIA ",1,"HACER CLIC AL BOTÓN ABAJO 1 VEZ",2]
[null,null,null,"PENAL DE GARANTÍAS",1,"HACER CLIC AL BOTÓN ABAJO 2 VECES",3,"TRAE LA CIUDAD "]
[null,null,null,"PENAL DE GARANTÍAS ORDINARIO - CAPITAL",1,"HACER CLIC AL BOTÓN ABAJO 3 VECES",4,{"$f":"IFERROR(INDEX(DATOS!$F$34:$F$213, SMALL(IF(DATOS!$E$34:$E$213=DATOS!H7, ROW(DATOS!$E$34:$E$213)-ROW(DATOS!$E$34)+1), DATOS!H34)), \"\")","v":""}]
[null,null,null,"PENAL DE GARANTÍAS DE LA ADOLESCENCIA",1,"HACER CLIC AL BOTÓN ABAJO 4 VECES",5]
[null,null,null,"PENAL DE GARANTÍAS EN CRIMEN ORGANIZADO - CAPITAL",1,"HACER CLIC AL BOTÓN ABAJO 5 VECES",6]
[null,null,null,"PENAL DE GARANTÍAS EN DELITOS ECONÓMICOS Y CORRUPCIÓN - CAPITAL",1,"HACER CLIC AL BOTÓN ABAJO 6 VECES",7]
[null,null,null,"PENAL DE GARANTÍAS Y PENAL DE GARANTÍAS DE LA ADOLESCENCIA",1,"HACER CLIC AL BOTÓN ABAJO 7 VECES",8]
[null,null,null,"PENAL DE SENTENCIA",1,"HACER CLIC AL BOTÓN ABAJO 8 VECES",9]
[null,null,null,"PENAL DE SENTENCIA ORDINARIO - CAPITAL",1,"HACER CLIC AL BOTÓN ABAJO 9 VECES",10]
[null,null,null,"PENAL DE SENTENCIA -TRIBUNAL UNIPERSONAL ",2,"COLONIA INDEPENDENCIA",1]
[null,null,null,"PENAL DE LIQUIDACIÓN Y SENTENCIA ",2,"VILLARRICA",2]
[null,null,null,"PENAL DE LIQUIDACIÓN Y SENTENCIA - TRIBUNAL UNIPERSONAL - CAPITAL",2,"HACER CLIC AL BOTÓN ABAJO 1 VEZ",3]
[null,null,null,"PENAL DE SENTENCIA EN CRIMEN ORGANIZADO - CAPITAL",2,"HACER CLIC AL BOTÓN ABAJO 2 VECES",4]
[null,null,null,"PENAL DE SENTENCIA EN DELITOS ECONÓMICOS Y CORRUPCIÓN - CAPITAL",2,"HACER CLIC AL BOTÓN ABAJO 3 VECES",5]
[null,null,null,null,2,"HACER CLIC AL BOTÓN ABAJO 4 VECES",6]
[null,null,null,null,2,"HACER CLIC AL BOTÓN ABAJO 5 VECES",7]
[null,null,null,null,2,"HACER CLIC AL BOTÓN ABAJO 6 VECES",8]
[null,null,null,null,2,"HACER CLIC AL BOTÓN ABAJO 7 VECES",9]
[null,null,null,null,2,"HACER CLIC AL BOTÓN ABAJO 8 VECES",10]
[null,null,null,null,3,"ENCARNACIÓN",1]
[null,null,null,null,3,"HOHENAU",2]
[null,null,null,null,3,"OBLIGADO",3]
[null,null,null,null,3,"SAN PEDRO DEL PARANÁ",4]
[null,null,null,null,3,"TOMÁS ROMERO PEREIRA ",5]
[null,null,null,null,3,"HACER CLIC AL BOTÓN ABAJO 1 VEZ",6]
[null,null,null,null,3,"HACER CLIC AL BOTÓN ABAJO 2 VECES",7]
[null,null,null,null,3,"HACER CLIC AL BOTÓN ABAJO 3 VECES",8]
[null,null,null,null,3,"HACER CLIC AL BOTÓN ABAJO 4 VECES",9]
[null,null,null,null,3,"HACER CLIC AL BOTÓN ABAJO 5 VECES",10]
[null,null,null,null,4,"CONCEPCIÓN",1]
[null,null,null,null,4,"HORQUETA",2]
[null,null,null,null,4,"HORQUETA Y ARROYITO",3]
[null,null,null,null,4,"VALLEMI",4]
[null,null,null,null,4,"YBY YAÚ Y AZOTE´Y",5]
[null,null,null,null,4,"HACER CLIC AL BOTÓN ABAJO 1 VEZ",6]
[null,null,null,null,4,"HACER CLIC AL BOTÓN ABAJO 2 VECES",7]
[null,null,null,null,4,"HACER CLIC AL BOTÓN ABAJO 3 VECES",8]
[null,null,null,null,4,"HACER CLIC AL BOTÓN ABAJO 4 VECES",9]
[null,null,null,null,4,"HACER CLIC AL BOTÓN ABAJO 5 VECES",10]
[null,null,null,null,5,"BELLA VISTA NORTE",1]
[null,null,null,null,5,"CAPITÁN BADO",2]
[null,null,null,null,5,"PEDRO JUAN CABALLERO",3]
[null,null,null,null,5,"HACER CLIC AL BOTÓN ABAJO 1 VEZ",4]
[null,null,null,null,5,"HACER CLIC AL BOTÓN ABAJO 2 VECES",5]
[null,null,null,null,5,"HACER CLIC AL BOTÓN ABAJO 3 VECES",6]
[null,null,null,null,5,"HACER CLIC AL BOTÓN ABAJO 4 VECES",7]
{"$rows_left_out":133}