{"text_format":"1","workbook":"xlsx","n_sheets":2,"sheets":["JUZGADO DE PAZ","DATO"],"not_rendered":{"charts":0,"images":0,"macros":1,"external_links":0,"defined_names":6,"comments":0,"pivot_tables":0},"unopened":[],"bounds":{"document_bytes":16777216,"sheet_cells":100000,"rows_first":2000,"rows_last":500,"rows_between":2000,"halvings":0,"cell_chars":16384,"cell_head_chars":4096},"cells_cut":0,"cells_raw":0,"read":"whole","date_system":"1900"}

{"sheet":"JUZGADO DE PAZ","index":0,"n_rows":1011,"n_cols":17,"rows_kept":1011,"cut":false,"hidden":false,"merged":[[9,16,10,16],[9,14,10,14],[9,15,10,15],[0,0,0,16],[1,0,1,16],[6,9,6,11],[2,14,2,15],[3,12,8,13],[3,14,4,15],[5,14,6,15],[7,14,8,15],[7,16,8,16],[5,16,6,16],[3,16,4,16],[6,7,6,8],[7,7,7,8],[9,2,10,2],[9,3,10,3],[9,0,10,0],[9,1,10,1],[9,10,9,13],[9,5,9,6],[9,4,10,4],[9,7,9,9],[8,0,8,1],[7,0,7,1],[2,2,2,11],[3,2,3,11],[5,2,5,11],[4,2,4,11],[8,2,8,6],[7,2,7,6],[6,2,6,6],[2,0,2,1],[3,0,3,1],[6,0,6,1],[5,0,5,1],[4,0,4,1],[8,7,8,8]]}
["JUZGADOS DE PAZ DE LA REPÚBLICA DEL PARAGUAY"]
["EXPEDIENTES/CAUSAS"]
["CIRCUNSCRIPCIÓN JUDICIAL: ",null,{"$f":"IF(DATO!D7=0,\"SELECCIONE SU CIRCUNSCRIPCIÓN----->\",IF(DATO!D7=1,\"1° CAPITAL\",IF(DATO!D7=2,\"2° GUAIRÁ\",IF(DATO!D7=3,\"3° ITAPÚA\",IF(DATO!D7=4,\"4° CONCEPCIÓN\",IF(DATO!D7=5,\"5°AMAMBAY\",IF(DATO!D7=6,\"6° ALTO PARANÁ\",IF(DATO!D7=7,\"7° CAAGUAZÚ\",IF(DATO!D7=8,\" 8° ÑEEMBUCÚ\",IF(DATO!D7=9,\" 9° MISIONES\",IF(DATO!D7=10,\"10° PARAGUARÍ\",IF(DATO!D7=11,\"11° CAAZAPÁ\",IF(DATO!D7=12,\"12° SAN PEDRO\",IF(DATO!D7=13,\"13° CORDILLERA\",IF(DATO!D7=14,\"14° PRESIDENTE HAYES\",IF(DATO!D7=15,\"15° CANINDEYÚ\",IF(DATO!D7=16,\"16° CENTRAL\",IF(DATO!D7=17,\"17° BOQUERÓN\",IF(DATO!D7=18,\"18° ALTO PARAGUAY\")))))))))))))))))))","v":"SELECCIONE SU CIRCUNSCRIPCIÓN----->"},null,null,null,null,null,null,null,null,null,"AÑO:",null,"INGRESE FECHA DE CORTE"]
["DISTRITO /CIUDAD:",null,{"$f":"IF(DATO!D7=0,\"SELECCIONE PRIMERO SU CIRCUNSCRIPCIÓN\",IF(DATO!J26=0,\"SELECCIONE SU DISTRITO / CIUDAD---->\",DATO!J29))","v":"SELECCIONE PRIMERO SU CIRCUNSCRIPCIÓN"},null,null,null,null,null,null,null,null,null,"PERIODO - CUATRIMESTRE",null,"1° CUATRIMESTRE"]
["JUZGADO DE PAZ",null,{"$f":"IF(DATO!D13=0,\"SELECCIONE SU JUZGADO----->\",IF(DATO!D13=1,DATO!F25,IF(DATO!D13=2,DATO!F26,IF(DATO!D13=3,DATO!F27,IF(DATO!D13=4,DATO!F28,IF(DATO!D13=4,DATO!F29))))))","v":"SELECCIONE SU JUZGADO----->"}]
["TURNO:",null,{"$f":"IF(DATO!D16=0,\"SELECCIONE SU TURNO----->\",IF(DATO!D16=1,\"UT\",IF(DATO!D16=2,\"1T\",IF(DATO!D16=3,\"2T\",IF(DATO!D16=4,\"3T\",IF(DATO!D16=5,\"4T\",IF(DATO!D16=6,\"5T\",IF(DATO!D16=7,\"6T\"))))))))","v":"SELECCIONE SU TURNO----->"},null,null,null,null,null,null,null,null,null,null,null,"2° CUATRIMESTRE"]
["NOMBRE COMPLETO DEL MAGISTRADO/A:",null,null,null,null,null,null,"VINCULACIÓN:"]
["NOMBRE COMPLETO DEL ACTUARIO/A:",null,null,null,null,null,null,"VINCULACIÓN:",null,null,"SECRETARÍA N°:",null,null,null," 3° CUATRIMESTRE"]
["NOMBRE COMPLETO DEL ACTUARIO/A:",null,null,null,null,null,null,"VINCULACIÓN:",null,null,"SECRETARÍA N°:"]
["N°                             ITEM","CARÁTULA COMPLETA","N° DE EXPEDIENTE /CAUSA N°","AÑO","FUERO","ÚLTIMO ACTO PROCESAL",null,"PENDENCIA",null,null,"MEDIDAS DE MEJOR PROVEER",null,null,null,"AUDIENCIA/S RE AGENDADA/S","CANTIDAD ","SECRETARÍA N°:"]
[null,null,null,null,null,"FECHA","TIPO DE ACTO","FECHA DE PROVIDENCIA DE LLAMADO A AUTOS  ","FECHA DE AUDIENCIA","TIPO DE PENDENCIA","SE DICTÓ MEDIDA DE MEJOR PROVEER","FECHA EN QUE SE DICTÓ LA MEDIDA ","CUMPLIMIENTO\n DE LA MEDIDA","FECHA EN QUE SE CUMPLIÓ LA MEDIDA "]
[1]
[{"$f":"IF(B13<>\"\",A12+1,\"\")","v":""}]
[{"$f":"IF(B14<>\"\",A13+1,\"\")","v":""}]
[""]
[""]
[""]
[""]
[{"$f":"IF(B19<>\"\",A18+1,\"\")","v":""}]
[""]
[""]
[""]
[""]
[""]
[""]
[""]
[""]
[""]
[""]
[""]
[""]
[""]
[""]
[""]
[""]
[""]
[""]
[""]
[""]
[""]
[""]
[""]
[""]
[""]
[""]
[""]
[""]
[""]
[""]
[""]
[""]
[""]
[""]
[""]
[""]
[""]
[""]
[""]
[""]
[""]
[""]
[""]
[""]
[""]
[""]
[""]
[""]
[""]
[""]
[""]
[""]
[""]
[""]
[""]
[""]
[""]
[""]
[{"$f":"IF(B78<>\"\",A77+1,\"\")","v":""}]
[""]
[""]
[""]
[""]
[""]
[""]
[""]
[""]
[""]
[""]
[""]
[""]
[""]
[""]
[""]
[""]
[""]
[""]
[""]
[""]
[""]
[""]
[""]
[""]
[""]
[""]
[""]
[""]
[""]
[""]
[""]
[""]
[""]
[""]
[""]
[""]
[""]
[""]
[""]
[""]
[""]
[""]
[""]
[""]
[""]
[""]
[""]
[""]
[""]
[""]
[""]
[""]
[""]
[""]
[""]
[""]
[""]
[""]
[""]
[""]
[""]
[""]
[""]
[{"$f":"IF(B142<>\"\",A141+1,\"\")","v":""}]
[""]
[""]
[""]
[""]
[""]
[""]
[""]
[""]
[""]
[""]
[""]
[""]
[""]
[""]
[""]
[""]
[""]
[""]
[""]
[""]
[""]
[""]
[""]
[""]
[""]
[""]
[""]
[""]
[""]
[""]
[""]
[""]
[""]
[""]
[""]
[""]
[""]
[""]
[""]
[""]
[""]
[""]
[""]
[""]
[""]
[""]
[""]
[""]
[""]
[""]
[""]
[""]
[""]
[""]
[""]
[""]
[""]
[""]
{"$rows_left_out":812}
{"sheet":"DATO","index":1,"n_rows":614,"n_cols":14,"rows_kept":614,"cut":false,"hidden":true,"merged":[[22,12,24,13],[20,12,21,13],[1,1,2,17]]}
[]
[null,"VALIDACIONES DE LA PLANILLA DE PENDENCIA"]
[]
[]
[]
[null,null,null,"SELEC  / CIRCUNS",null,"VINCULACIÓN",null,"TIPO DE PENDENCIA",null,"TIPO DE ACTO"]
[null,null,null,0,null,"TITULAR",null,"AUTOS PARA RESOLVER ",null,"JUZGADO"]
[null,null,null,null,null,"INTERINO/A",null,"AUTOS PARA SENTENCIA",null,"PARTES"]
[null,null,null,"SELEC / CUATRI",null,"ITINERANTE",null,"AUDIENCIA",null,"OTROS",null,null,"CIVIL Y COMERCIAL","AUTOS PARA RESOLVER"]
[null,null,null,1,null,null,null,null,null,null,null,null,null,"AUTOS PARA SENTENCIA"]
[null,null,null,null,null,"FUERO - CUERPO",null,"OPCIONES SI Y NO",null,null,null,null,"LABORAL","AUTOS PARA RESOLVER"]
[null,null,null,"SELEC / FUERO",null,"CIVIL Y COMERCIAL",null,"SI",null,null,null,null,null,"AUTOS PARA SENTENCIA"]
[null,null,null,0,null,"LABORAL",null,"NO",null,null,null,null,"NIÑEZ Y ADOLESCENCIA","AUTOS PARA RESOLVER"]
[null,null,null,null,null,"NIÑEZ Y ADOLESCENCIA",null,null,null,null,null,null,null,"AUTOS PARA SENTENCIA"]
[null,null,null,"SELEC / TURNO",null,"PENAL",null,null,null,null,null,null,"PENAL","AUDIENCIA"]
[null,null,null,0,null,null,null,"CIRCUNSCRIPCIONES"]
[null,null,null,null,null,null,null,"1° CAPITAL",null,null,null,null,"Ley Especial","Autos para Resolver"]
[null,null,null,null,null,"VINCULACIÓN",null,"2° GUAIRÁ",null,null,null,null,null,"Autos para Sentencia"]
[null,null,null,null,null,"TITULAR",null,"3° ITAPÚA",null,null,null,null,null,"Audiencia"]
[null,null,null,null,null,"INTERINO/A",null,"4° CONCEPCIÓN"]
[null,null,null,null,null,"COMISIONADO/A",null,"5° AMAMBAY",null,null,null,null,"LO QUE ESTA RESALTADO EN AMARILLO YA NO SE UTILIZÁ"]
[null,null,null,null,null,null,null,"6° ALTO PARANÁ"]
[null,null,null,null,null,null,null,"7° CAAGUAZÚ",null,null,null,null,"NO SE ELIMINA LOS DATOS DE ARRIBA, PORQUE SON PARTE DE LA FORMULA PARA EL TIPO DE PENDENCIA SEGÚN EL FUERO"]
[null,null,null,null,null,"JUZGADO DE PAZ - ENCABEZADO",null,"8° ÑEEMBUCÚ"]
[null,null,null,null,null,"CIVIL Y COMERCIAL",null,"9° MISIONES",null,"SELEC / CIUDAD"]
[null,null,null,null,null,"MULTIFUERO CIVIL, COMERCIAL Y LABORAL",null,"10° PARAGUARÍ",null,0]
[null,null,null,null,null,"MULTIFUERO CIVIL, COMERCIAL, LABORAL, NIÑEZ Y ADOLESCENCIA",null,"11° CAAZAPÁ"]
[null,null,null,null,null,"MULTIFUERO CIVIL, COMERCIAL, LABORAL, NIÑEZ  Y ADOLESCENCIA, Y PENAL",null,"12° SAN PEDRO",null,"TRAE LA CIUDAD "]
[null,null,null,null,null,null,null,"13° CORDILLERA",null,{"$f":"IFERROR(INDEX(DATO!$H$38:$H$614, SMALL(IF(DATO!$G$38:$G$614=DATO!D7, ROW(DATO!$G$38:$G$614)-ROW(DATO!$G$38)+1), DATO!J26)), \"\")","v":""}]
[null,null,null,null,null,null,null,"14° PRESIDENTE HAYES"]
[null,null,null,null,null,null,null,"15° CANINDEYÚ"]
[null,null,null,null,null,null,null,"16° CENTRAL"]
[null,null,null,null,null,null,null,"17° BOQUERÓN"]
[null,null,null,null,null,null,null,"18° ALTO PARAGUAY"]
[]
[]
[null,null,null,null,null,null,"N°","LOCALIDAD / CIUDAD","Columna1","Columna2"]
[null,null,null,null,null,null,1,"LA CATEDRAL - ASUNCIÓN",1]
[null,null,null,null,null,null,1,"LA ENCARNACIÓN - ASUNCIÓN",2]
[null,null,null,null,null,null,1,"LA RECOLETA - ASUNCIÓN",3]
[null,null,null,null,null,null,1,"SAN ROQUE - ASUNCIÓN",4]
[null,null,null,null,null,null,1,"SANTÍSIMA TRINIDAD - ASUNCIÓN",5]
[null,null,null,null,null,null,1,"VILLA MORRA - ASUNCIÓN",6]
[null,null,null,null,null,null,1,"HACER CLIC AL BOTÓN ABAJO 1 VEZ",7]
[null,null,null,null,null,null,1,"HACER CLIC AL BOTÓN ABAJO 2 VECES",8]
[null,null,null,null,null,null,1,"HACER CLIC AL BOTÓN ABAJO 3 VECES",9]
[null,null,null,null,null,null,1,"HACER CLIC AL BOTÓN ABAJO 4 VECES",10]
[null,null,null,null,null,null,1,"HACER CLIC AL BOTÓN ABAJO 5 VECES",11]
[null,null,null,null,null,null,1,"HACER CLIC AL BOTÓN ABAJO 6 VECES",12]
[null,null,null,null,null,null,1,"HACER CLIC AL BOTÓN ABAJO 7 VECES",13]
[null,null,null,null,null,null,1,"HACER CLIC AL BOTÓN ABAJO 8 VECES",14]
[null,null,null,null,null,null,1,"HACER CLIC AL BOTÓN ABAJO 9 VECES",15]
[null,null,null,null,null,null,1,"HACER CLIC AL BOTÓN ABAJO 10 VECES",16]
[null,null,null,null,null,null,1,"HACER CLIC AL BOTÓN ABAJO 11 VECES",17]
[null,null,null,null,null,null,1,"HACER CLIC AL BOTÓN ABAJO 12 VECES",18]
[null,null,null,null,null,null,1,"HACER CLIC AL BOTÓN ABAJO 13 VECES",19]
[null,null,null,null,null,null,1,"HACER CLIC AL BOTÓN ABAJO 14 VECES",20]
[null,null,null,null,null,null,1,"HACER CLIC AL BOTÓN ABAJO 15 VECES",21]
[null,null,null,null,null,null,1,"HACER CLIC AL BOTÓN ABAJO 16 VECES",22]
[null,null,null,null,null,null,1,"HACER CLIC AL BOTÓN ABAJO 17 VECES",23]
[null,null,null,null,null,null,1,"HACER CLIC AL BOTÓN ABAJO 18 VECES",24]
[null,null,null,null,null,null,1,"HACER CLIC AL BOTÓN ABAJO 19 VECES",25]
[null,null,null,null,null,null,1,"HACER CLIC AL BOTÓN ABAJO 20 VECES",26]
[null,null,null,null,null,null,1,"HACER CLIC AL BOTÓN ABAJO 21 VECES",27]
[null,null,null,null,null,null,1,"HACER CLIC AL BOTÓN ABAJO 22 VECES",28]
[null,null,null,null,null,null,1,"HACER CLIC AL BOTÓN ABAJO 23 VECES",29]
[null,null,null,null,null,null,1,"HACER CLIC AL BOTÓN ABAJO 24 VECES",30]
[null,null,null,null,null,null,1,"HACER CLIC AL BOTÓN ABAJO 25 VECES",31]
[null,null,null,null,null,null,1,"HACER CLIC AL BOTÓN ABAJO 26 VECES",32]
[null,null,null,null,null,null,2,"BORJA",1]
[null,null,null,null,null,null,2,"COLONIA INDEPENDENCIA",2]
[null,null,null,null,null,null,2,"CORONEL MARTÍNEZ",3]
[null,null,null,null,null,null,2,"DOCTOR JAMES BOTTRELL",4]
[null,null,null,null,null,null,2,"FÉLIX PÉREZ CARDOZO",5]
[null,null,null,null,null,null,2,"GENERAL EUGENIO ALEJANDRINO GARAY ",6]
[null,null,null,null,null,null,2,"ITAPÉ",7]
[null,null,null,null,null,null,2,"ITURBE",8]
[null,null,null,null,null,null,2,"JOSÉ FASSARDI",9]
[null,null,null,null,null,null,2,"MAURICIO JOSÉ TROCHE",10]
[null,null,null,null,null,null,2,"MBOCAYATY",11]
[null,null,null,null,null,null,2,"NATALICIO TALAVERA",12]
[null,null,null,null,null,null,2,"ÑUMÍ",13]
[null,null,null,null,null,null,2,"PASO YOBAI",14]
[null,null,null,null,null,null,2,"SAN SALVADOR ",15]
[null,null,null,null,null,null,2,"TEBICUARY",16]
[null,null,null,null,null,null,2,"VILLARRICA",17]
[null,null,null,null,null,null,2,"YATAITY",18]
[null,null,null,null,null,null,2,"HACER CLIC AL BOTÓN ABAJO 1 VEZ",19]
[null,null,null,null,null,null,2,"HACER CLIC AL BOTÓN ABAJO 2 VECES",20]
[null,null,null,null,null,null,2,"HACER CLIC AL BOTÓN ABAJO 3 VECES",21]
[null,null,null,null,null,null,2,"HACER CLIC AL BOTÓN ABAJO 4 VECES",22]
[null,null,null,null,null,null,2,"HACER CLIC AL BOTÓN ABAJO 5 VECES",23]
[null,null,null,null,null,null,2,"HACER CLIC AL BOTÓN ABAJO 6 VECES",24]
[null,null,null,null,null,null,2,"HACER CLIC AL BOTÓN ABAJO 7 VECES",25]
[null,null,null,null,null,null,2,"HACER CLIC AL BOTÓN ABAJO 8 VECES",26]
[null,null,null,null,null,null,2,"HACER CLIC AL BOTÓN ABAJO 9 VECES",27]
[null,null,null,null,null,null,2,"HACER CLIC AL BOTÓN ABAJO 10 VECES",28]
[null,null,null,null,null,null,2,"HACER CLIC AL BOTÓN ABAJO 11 VECES",29]
[null,null,null,null,null,null,2,"HACER CLIC AL BOTÓN ABAJO 12 VECES",30]
[null,null,null,null,null,null,2,"HACER CLIC AL BOTÓN ABAJO 13 VECES",31]
[null,null,null,null,null,null,2,"HACER CLIC AL BOTÓN ABAJO 14 VECES",32]
[null,null,null,null,null,null,3,"ALTO VERÁ",1]
[null,null,null,null,null,null,3,"BARRIO SAN ISIDRO - ENCARNACIÓN",2]
[null,null,null,null,null,null,3,"BELLA VISTA",3]
[null,null,null,null,null,null,3,"CAMBYRETA",4]
[null,null,null,null,null,null,3,"CAPITÁN MEZA",5]
[null,null,null,null,null,null,3,"CAPITÁN MIRANDA",6]
[null,null,null,null,null,null,3,"CARLOS ANTONIO LÓPEZ",7]
[null,null,null,null,null,null,3,"CARMEN DEL PARANÁ",8]
[null,null,null,null,null,null,3,"CORONEL BOGADO",9]
[null,null,null,null,null,null,3,"DOCTOR FRANCISCO ESCULÍES - ENCARNACIÓN",10]
[null,null,null,null,null,null,3,"EDELIRA",11]
[null,null,null,null,null,null,3,"ENCARNACIÓN",12]
[null,null,null,null,null,null,3,"FRAM",13]
[null,null,null,null,null,null,3,"GENERAL ARTIGAS",14]
[null,null,null,null,null,null,3,"GENERAL DELGADO",15]
[null,null,null,null,null,null,3,"HOHENAU",16]
[null,null,null,null,null,null,3,"ITAPÚA POTY",17]
[null,null,null,null,null,null,3,"JESÚS",18]
[null,null,null,null,null,null,3,"JOSÉ LEANDRO OVIEDO",19]
[null,null,null,null,null,null,3,"LA PAZ",20]
[null,null,null,null,null,null,3,"MAYOR JULIO DIONISIO OTAÑO",21]
[null,null,null,null,null,null,3,"NATALIO",22]
[null,null,null,null,null,null,3,"NUEVA ALBORADA",23]
[null,null,null,null,null,null,3,"OBLIGADO",24]
[null,null,null,null,null,null,3,"PIRAPÓ",25]
[null,null,null,null,null,null,3,"SAN COSME Y DAMIÁN",26]
[null,null,null,null,null,null,3,"SAN JUAN DEL PARANÁ",27]
[null,null,null,null,null,null,3,"SAN PEDRO DEL PARANÁ",28]
[null,null,null,null,null,null,3,"SAN RAFAEL DEL PARANÁ",29]
[null,null,null,null,null,null,3,"TOMÁS ROMERO PEREIRA",30]
[null,null,null,null,null,null,3,"TRINIDAD",31]
[null,null,null,null,null,null,3,"YATYTAY",32]
[null,null,null,null,null,null,4,"ARROYITO",1]
[null,null,null,null,null,null,4,"AZOTE´Y",2]
[null,null,null,null,null,null,4,"BELÉN",3]
[null,null,null,null,null,null,4,"CONCEPCIÓN",4]
[null,null,null,null,null,null,4,"HORQUETA",5]
[null,null,null,null,null,null,4,"LORETO Y PASO HORQUETA",6]
[null,null,null,null,null,null,4,"PASO BARRETO",7]
[null,null,null,null,null,null,4,"SAN ALFREDO",8]
[null,null,null,null,null,null,4,"SAN CARLOS DEL APA",9]
[null,null,null,null,null,null,4,"SARGENTO JOSÉ FÉLIX LÓPEZ",10]
[null,null,null,null,null,null,4,"VALLEMI",11]
[null,null,null,null,null,null,4,"YBY YAÚ",12]
[null,null,null,null,null,null,4,"HACER CLIC AL BOTÓN ABAJO 1 VEZ",13]
[null,null,null,null,null,null,4,"HACER CLIC AL BOTÓN ABAJO 2 VECES",14]
[null,null,null,null,null,null,4,"HACER CLIC AL BOTÓN ABAJO 3 VECES",15]
[null,null,null,null,null,null,4,"HACER CLIC AL BOTÓN ABAJO 4 VECES",16]
[null,null,null,null,null,null,4,"HACER CLIC AL BOTÓN ABAJO 5 VECES",17]
[null,null,null,null,null,null,4,"HACER CLIC AL BOTÓN ABAJO 6 VECES",18]
[null,null,null,null,null,null,4,"HACER CLIC AL BOTÓN ABAJO 7 VECES",19]
[null,null,null,null,null,null,4,"HACER CLIC AL BOTÓN ABAJO 8 VECES",20]
[null,null,null,null,null,null,4,"HACER CLIC AL BOTÓN ABAJO 9 VECES",21]
[null,null,null,null,null,null,4,"HACER CLIC AL BOTÓN ABAJO 10 VECES",22]
[null,null,null,null,null,null,4,"HACER CLIC AL BOTÓN ABAJO 11 VECES",23]
[null,null,null,null,null,null,4,"HACER CLIC AL BOTÓN ABAJO 12 VECES",24]
[null,null,null,null,null,null,4,"HACER CLIC AL BOTÓN ABAJO 13 VECES",25]
[null,null,null,null,null,null,4,"HACER CLIC AL BOTÓN ABAJO 14 VECES",26]
[null,null,null,null,null,null,4,"HACER CLIC AL BOTÓN ABAJO 15 VECES",27]
[null,null,null,null,null,null,4,"HACER CLIC AL BOTÓN ABAJO 16 VECES",28]
[null,null,null,null,null,null,4,"HACER CLIC AL BOTÓN ABAJO 17 VECES",29]
[null,null,null,null,null,null,4,"HACER CLIC AL BOTÓN ABAJO 18 VECES",30]
[null,null,null,null,null,null,4,"HACER CLIC AL BOTÓN ABAJO 19 VECES",31]
[null,null,null,null,null,null,4,"HACER CLIC AL BOTÓN ABAJO 20 VECES",32]
[null,null,null,null,null,null,5,"BELLA VISTA NORTE",1]
[null,null,null,null,null,null,5,"CAPITÁN BADO",2]
[null,null,null,null,null,null,5,"CERRO CORA",3]
[null,null,null,null,null,null,5,"KARAPAÍ",4]
[null,null,null,null,null,null,5,"PEDRO JUAN CABALLERO",5]
[null,null,null,null,null,null,5,"ZANJA PYTÁ",6]
[null,null,null,null,null,null,5,"HACER CLIC AL BOTÓN ABAJO 1 VEZ",7]
[null,null,null,null,null,null,5,"HACER CLIC AL BOTÓN ABAJO 2 VECES",8]
[null,null,null,null,null,null,5,"HACER CLIC AL BOTÓN ABAJO 3 VECES",9]
[null,null,null,null,null,null,5,"HACER CLIC AL BOTÓN ABAJO 4 VECES",10]
[null,null,null,null,null,null,5,"HACER CLIC AL BOTÓN ABAJO 5 VECES",11]
[null,null,null,null,null,null,5,"HACER CLIC AL BOTÓN ABAJO 6 VECES",12]
[null,null,null,null,null,null,5,"HACER CLIC AL BOTÓN ABAJO 7 VECES",13]
[null,null,null,null,null,null,5,"HACER CLIC AL BOTÓN ABAJO 8 VECES",14]
[null,null,null,null,null,null,5,"HACER CLIC AL BOTÓN ABAJO 9 VECES",15]
[null,null,null,null,null,null,5,"HACER CLIC AL BOTÓN ABAJO 10 VECES",16]
[null,null,null,null,null,null,5,"HACER CLIC AL BOTÓN ABAJO 11 VECES",17]
[null,null,null,null,null,null,5,"HACER CLIC AL BOTÓN ABAJO 12 VECES",18]
[null,null,null,null,null,null,5,"HACER CLIC AL BOTÓN ABAJO 13 VECES",19]
[null,null,null,null,null,null,5,"HACER CLIC AL BOTÓN ABAJO 14 VECES",20]
[null,null,null,null,null,null,5,"HACER CLIC AL BOTÓN ABAJO 15 VECES",21]
[null,null,null,null,null,null,5,"HACER CLIC AL BOTÓN ABAJO 16 VECES",22]
[null,null,null,null,null,null,5,"HACER CLIC AL BOTÓN ABAJO 17 VECES",23]
[null,null,null,null,null,null,5,"HACER CLIC AL BOTÓN ABAJO 18 VECES",24]
[null,null,null,null,null,null,5,"HACER CLIC AL BOTÓN ABAJO 19 VECES",25]
[null,null,null,null,null,null,5,"HACER CLIC AL BOTÓN ABAJO 20 VECES",26]
[null,null,null,null,null,null,5,"HACER CLIC AL BOTÓN ABAJO 21 VECES",27]
[null,null,null,null,null,null,5,"HACER CLIC AL BOTÓN ABAJO 22 VECES",28]
[null,null,null,null,null,null,5,"HACER CLIC AL BOTÓN ABAJO 23 VECES",29]
[null,null,null,null,null,null,5,"HACER CLIC AL BOTÓN ABAJO 24 VECES",30]
[null,null,null,null,null,null,5,"HACER CLIC AL BOTÓN ABAJO 25 VECES",31]
[null,null,null,null,null,null,5,"HACER CLIC AL BOTÓN ABAJO 26 VECES",32]
[null,null,null,null,null,null,6,"CIUDAD DEL ESTE",1]
[null,null,null,null,null,null,6,"DOCTOR JUAN LEÓN MALLORQUÍN",2]
[null,null,null,null,null,null,6,"DOCTOR RAÚL PEÑA",3]
{"$rows_left_out":414}