{"text_format":"1","workbook":"xlsx","n_sheets":2,"sheets":["1° INSTANCIA MULTIFUERO","DATOS"],"not_rendered":{"charts":0,"images":0,"macros":1,"external_links":0,"defined_names":7,"comments":0,"pivot_tables":0},"unopened":[],"bounds":{"document_bytes":16777216,"sheet_cells":100000,"rows_first":2000,"rows_last":500,"rows_between":2000,"halvings":0,"cell_chars":16384,"cell_head_chars":4096},"cells_cut":0,"cells_raw":0,"read":"whole","date_system":"1900"}

{"sheet":"1° INSTANCIA MULTIFUERO","index":0,"n_rows":1011,"n_cols":17,"rows_kept":1011,"cut":false,"hidden":false,"merged":[[9,0,10,0],[9,1,10,1],[9,10,9,13],[9,5,9,6],[9,4,10,4],[9,7,9,9],[9,2,10,2],[9,3,10,3],[8,2,8,6],[7,2,7,6],[9,16,10,16],[9,14,10,14],[9,15,10,15],[3,12,8,13],[3,14,4,15],[5,14,6,15],[7,14,8,15],[7,16,8,16],[5,16,6,16],[3,16,4,16],[7,7,7,8],[8,7,8,8],[0,0,0,16],[1,0,1,16],[6,9,6,11],[2,14,2,15],[5,2,5,11],[4,2,4,11],[3,2,3,11],[2,2,2,11],[6,2,6,6],[2,0,2,1],[3,0,3,1],[6,7,6,8],[8,0,8,1],[7,0,7,1],[6,0,6,1],[5,0,5,1],[4,0,4,1]]}
["JUZGADOS DE PRIMERA INSTANCIA MULTIFUERO DE LA REPÚBLICA DEL PARAGUAY"]
["APLICA PARA LOS QUE ENTIENDEN MÁS DE UNO DE LOS SIGUIENTES FUEROS CIVIL, COMERCIAL Y/O LABORAL Y/O DE LA NIÑEZ Y DE LA ADOLESCENCIA Y/O PENAL"]
["CIRCUNSCRIPCIÓN JUDICIAL: ",null,{"$f":"IF(DATOS!D7=0,\"SELECCIONE SU CIRCUNSCRIPCIÓN----->\",IF(DATOS!D7=1,\"1° CAPITAL\",IF(DATOS!D7=2,\"2° GUAIRÁ\",IF(DATOS!D7=3,\"3° ITAPÚA\",IF(DATOS!D7=4,\"4° CONCEPCIÓN\",IF(DATOS!D7=5,\"5°AMAMBAY\",IF(DATOS!D7=6,\"6° ALTO PARANÁ\",IF(DATOS!D7=7,\"7° CAAGUAZÚ\",IF(DATOS!D7=8,\" 8° ÑEEMBUCÚ\",IF(DATOS!D7=9,\" 9° MISIONES\",IF(DATOS!D7=10,\"10° PARAGUARÍ\",IF(DATOS!D7=11,\"11° CAAZAPÁ\",IF(DATOS!D7=12,\"12° SAN PEDRO\",IF(DATOS!D7=13,\"13° CORDILLERA\",IF(DATOS!D7=14,\"14° PRESIDENTE HAYES\",IF(DATOS!D7=15,\"15° CANINDEYÚ\",IF(DATOS!D7=16,\"16° CENTRAL\",IF(DATOS!D7=17,\"17° BOQUERÓN\",IF(DATOS!D7=18,\"18° ALTO PARAGUAY\")))))))))))))))))))","v":"SELECCIONE SU CIRCUNSCRIPCIÓN----->"},null,null,null,null,null,null,null,null,null,"AÑO:",null,"INGRESE FECHA DE CORTE"]
["CIUDAD:",null,{"$f":"IF(DATOS!D7=0,\"SELECCIONE PRIMERO SU CIRCUNSCRIPCIÓN\",IF(DATOS!J37=0,\"SELECCIONE SU CIUDAD---->\",DATOS!J40))","v":"SELECCIONE PRIMERO SU CIRCUNSCRIPCIÓN"},null,null,null,null,null,null,null,null,null,"PERIODO - CUATRIMESTRE",null,"1° CUATRIMESTRE "]
["JUZGADO DE PRIMERA INSTANCIA:",null,{"$f":"IF(DATOS!D13=0,\"SELECCIONE SU JUZGADO----->\",IF(DATOS!D13=1,DATOS!F27,IF(DATOS!D13=2,DATOS!F28,IF(DATOS!D13=3,DATOS!F29,IF(DATOS!D13=4,DATOS!F30,IF(DATOS!D13=5,DATOS!F31,IF(DATOS!D13=6,DATOS!F32,IF(DATOS!D13=7,DATOS!F33,IF(DATOS!D13=8,DATOS!F34,IF(DATOS!D13=9,DATOS!F35))))))))))","v":"SELECCIONE SU JUZGADO----->"}]
["TURNO/NÚMERO:",null,{"$f":"IF(DATOS!D16=0,\"SELECCIONE SU TURNO o NÚMERO----->\",IF(DATOS!D16=1,\"UT\",IF(DATOS!D16=2,\"1T\",IF(DATOS!D16=3,\"2T\",IF(DATOS!D16=4,\"3T\",IF(DATOS!D16=5,\"4T\",IF(DATOS!D16=6,\"5T\",IF(DATOS!D16=7,\"6T\",IF(DATOS!D16=8,\"N1\",IF(DATOS!D16=9,\"N2\",IF(DATOS!D16=10,\"N3\",IF(DATOS!D16=11,\"N4\",IF(DATOS!D16=12,\"N5\",IF(DATOS!D16=13,\"N6\",IF(DATOS!D16=14,\"N7\",IF(DATOS!D16=15,\"N8\"))))))))))))))))","v":"SELECCIONE SU TURNO o NÚMERO----->"},null,null,null,null,null,null,null,null,null,null,null,"2° CUATRIMESTRE"]
["NOMBRE COMPLETO DEL MAGISTRADO/A:",null,null,null,null,null,null,"VINCULACIÓN:"]
["NOMBRE COMPLETO DEL ACTUARIO/A:",null,null,null,null,null,null,"VINCULACIÓN:",null,null,"SECRETARÍA N°:",null,null,null," 3° CUATRIMESTRE "]
["NOMBRE COMPLETO DEL ACTUARIO/A:",null,null,null,null,null,null,"VINCULACIÓN:",null,null,"SECRETARÍA N°:"]
["N°                             ITEM","CARÁTULA COMPLETA ","N°EXPEDIENTE /CAUSA N°","AÑO","FUERO","ÚLTIMO ACTO PROCESAL",null,"PENDENCIA",null,null,"MEDIDAS DE MEJOR PROVEER",null,null,null,"AUDIENCIAS RE AGENDADAS","CANTIDAD ","SECRETARÍA N°:"]
[null,null,null,null,null,"FECHA","TIPO DE ACTO","FECHA DE PROVIDENCIA DE LLAMADO A AUTOS","FECHA DE AUDIENCIA","TIPO DE PENDENCIA","SE DICTÓ MEDIDA DE MEJOR PROVEER","FECHA EN QUE SE DICTÓ LA MEDIDA ","CUMPLIMIENTO\n DE LA MEDIDA","FECHA EN QUE SE CUMPLIÓ LA MEDIDA "]
[1]
[{"$f":"IF(B13<>\"\",A12+1,\"\")","v":""}]
[{"$f":"IF(B14<>\"\",A13+1,\"\")","v":""}]
[""]
[""]
[""]
[""]
[""]
[""]
[""]
[""]
[""]
[""]
[""]
[""]
[""]
[""]
[""]
[""]
[""]
[""]
[""]
[""]
[""]
[""]
[""]
[""]
[""]
[""]
[""]
[""]
[""]
[""]
[""]
[""]
[""]
[""]
[""]
[""]
[""]
[""]
[""]
[""]
[""]
[""]
[""]
[""]
[""]
[""]
[""]
[""]
[""]
[""]
[""]
[""]
[""]
[""]
[""]
[""]
[""]
[""]
[""]
[""]
[""]
[""]
[""]
[{"$f":"IF(B78<>\"\",A77+1,\"\")","v":""}]
[""]
[""]
[""]
[""]
[""]
[""]
[""]
[""]
[""]
[""]
[""]
[""]
[""]
[""]
[""]
[""]
[""]
[""]
[""]
[""]
[""]
[""]
[""]
[""]
[""]
[""]
[""]
[""]
[""]
[""]
[""]
[""]
[""]
[""]
[""]
[""]
[""]
[""]
[""]
[""]
[""]
[""]
[""]
[""]
[""]
[""]
[""]
[""]
[""]
[""]
[""]
[""]
[""]
[""]
[""]
[""]
[""]
[""]
[""]
[""]
[""]
[""]
[""]
[{"$f":"IF(B142<>\"\",A141+1,\"\")","v":""}]
[""]
[""]
[""]
[""]
[""]
[""]
[""]
[""]
[""]
[""]
[""]
[""]
[""]
[""]
[""]
[""]
[""]
[""]
[""]
[""]
[""]
[""]
[""]
[""]
[""]
[""]
[""]
[""]
[""]
[""]
[""]
[""]
[""]
[""]
[""]
[""]
[""]
[""]
[""]
[""]
[""]
[""]
[""]
[""]
[""]
[""]
[""]
[""]
[""]
[""]
[""]
[""]
[""]
[""]
[""]
[""]
[""]
[""]
[""]
[""]
[""]
[""]
[""]
[{"$f":"IF(B206<>\"\",A205+1,\"\")","v":""}]
[""]
[""]
[""]
[""]
[""]
[""]
[""]
[""]
[""]
[""]
[""]
[""]
[""]
[""]
[""]
[""]
[""]
[""]
[""]
[""]
[""]
[""]
[""]
[""]
[""]
[""]
[""]
[""]
[""]
[""]
[""]
[""]
[""]
[""]
[""]
[""]
[""]
[""]
[""]
[""]
[""]
[""]
[""]
[""]
[""]
[""]
[""]
[""]
[""]
[""]
[""]
[""]
[""]
[""]
[""]
[""]
[""]
[""]
[""]
[""]
[""]
[""]
[""]
[{"$f":"IF(B270<>\"\",A269+1,\"\")","v":""}]
[""]
[""]
[""]
[""]
[""]
[""]
[""]
[""]
[""]
[""]
[""]
[""]
[""]
[""]
[""]
[""]
[""]
[""]
[""]
[""]
[""]
[""]
[""]
[""]
[""]
[""]
[""]
[""]
[""]
[""]
[""]
[""]
[""]
[""]
[""]
[""]
[""]
[""]
[""]
[""]
[""]
[""]
[""]
[""]
[""]
[""]
[""]
[""]
[""]
[""]
[""]
[""]
[""]
[""]
[""]
[""]
[""]
[""]
[""]
[""]
[""]
[""]
[""]
[{"$f":"IF(B334<>\"\",A333+1,\"\")","v":""}]
[""]
[""]
[""]
[""]
[""]
[""]
[""]
[""]
[""]
[""]
[""]
[""]
[""]
[""]
[""]
[""]
[""]
[""]
[""]
[""]
[""]
[""]
[""]
[""]
[""]
[""]
[""]
[""]
[""]
[""]
[""]
[""]
[""]
[""]
[""]
[""]
[""]
[""]
[""]
[""]
[""]
[""]
[""]
[""]
[""]
[""]
[""]
[""]
[""]
[""]
[""]
[""]
[""]
[""]
[""]
[""]
[""]
[""]
[""]
[""]
[""]
[""]
[""]
[{"$f":"IF(B398<>\"\",A397+1,\"\")","v":""}]
[""]
[""]
{"$rows_left_out":612}
{"sheet":"DATOS","index":1,"n_rows":216,"n_cols":14,"rows_kept":216,"cut":false,"hidden":true,"merged":[[1,1,2,11]]}
[]
[null,"VALIDACIONES DE LA PLANILLA DE PENDENCIA"]
[]
[]
[]
[null,null,null,"SELEC  / CIRCUNS",null,"VINCULACIÓN",null,"TIPO DE PENDENCIA",null,"TIPO DE ACTO"]
[null,null,null,0,null,"TITULAR",null,"AUTOS PARA RESOLVER",null,"JUZGADO"]
[null,null,null,null,null,"INTERINO/A",null,"AUTOS PARA SENTENCIA",null,"PARTES"]
[null,null,null,"SELEC / CUATRI",null,"ITINERANTE",null,"PRELIMINAR",null,"OTROS",null,null,"CIVIL Y COMERCIAL","AUTOS PARA RESOLVER"]
[null,null,null,1,null,null,null,null,null,null,null,null,null,"AUTOS PARA SENTENCIA"]
[null,null,null,null,null,"FUERO - CUERPO",null,"OPCIONES SI Y NO",null,null,null,null,"LABORAL","AUTOS PARA RESOLVER"]
[null,null,null,"SELEC / FUERO",null,"CIVIL Y COMERCIAL",null,"SÍ",null,null,null,null,null,"AUTOS PARA SENTENCIA"]
[null,null,null,0,null,"LABORAL",null,"NO",null,null,null,null,"NIÑEZ Y ADOLESCENCIA","AUTOS PARA RESOLVER"]
[null,null,null,null,null,"NIÑEZ Y ADOLESCENCIA",null,null,null,null,null,null,null,"AUTOS PARA SENTENCIA"]
[null,null,null,"SELEC / TURNO",null,"PENAL",null,null,null,null,null,null,"GARANTÍAS","PRELIMINAR"]
[null,null,null,0,null,"PENAL DE LA ADOLESCENCIA",null,"CIRCUNSCRIPCIONES"]
[null,null,null,null,null,null,null,"1° CAPITAL",null,null,null,null,"GARANTÍAS ADOLESCENTE","PRELIMINAR"]
[null,null,null,null,null,"VINCULACIÓN",null,"2° GUAIRÁ"]
[null,null,null,null,null,"TITULAR",null,"3° ITAPÚA"]
[null,null,null,null,null,"INTERINO/A",null,"4° CONCEPCIÓN"]
[null,null,null,null,null,"COMISIONADO/A",null,"5° AMAMBAY"]
[null,null,null,null,null,null,null,"6° ALTO PARANÁ"]
[null,null,null,null,null,null,null,"7° CAAGUAZÚ"]
[null,null,null,null,null,null,null,"8° ÑEEMBUCÚ"]
[null,null,null,null,null,null,null,"9° MISIONES"]
[null,null,null,null,null,"JUZGADO DE PRIMERA INSTANCIA - ENCABEZADO",null,"10° PARAGUARÍ"]
[null,null,null,null,null,"CIVIL Y COMERCIAL",null,"11° CAAZAPÁ"]
[null,null,null,null,null,"LABORAL ",null,"12° SAN PEDRO"]
[null,null,null,null,null,"NIÑEZ Y ADOLESCENCIA",null,"13° CORDILLERA"]
[null,null,null,null,null,"CIVIL, COMERCIAL Y LABORAL",null,"14° PRESIDENTE HAYES"]
[null,null,null,null,null,"CIVIL, COMERCIAL, LABORAL Y NIÑEZ Y ADOLESCENCIA",null,"15° CANINDEYÚ"]
[null,null,null,null,null,"CIVIL, COMERCIAL, LABORAL, NIÑEZ Y ADOLESCENCIA Y PENAL DE GARANTÍAS",null,"16° CENTRAL"]
[null,null,null,null,null,"CIVIL, COMERCIAL, LABORAL, NIÑEZ Y ADOLESCENCIA, PENAL DE GARANTÍAS Y PENAL DE GARANTÍAS DE LA ADOLESCENCIA",null,"17° BOQUERÓN"]
[null,null,null,null,null,"PENAL DE GARANTÍAS",null,"18° ALTO PARAGUAY"]
[null,null,null,null,null,"PENAL DE LA ADOLESCENCIA"]
[null,null,null,null,null,null,"1","HACER CLIC AL BOTÓN ABAJO 9 VECES","10","SELEC / CIUDAD"]
[null,null,null,null,null,null,1,"ASUNCIÓN",1,0]
[null,null,null,null,null,null,1,"HACER CLIC AL BOTÓN ABAJO 1 VEZ",2]
[null,null,null,null,null,null,1,"HACER CLIC AL BOTÓN ABAJO 2 VECES",3,"TRAE LA CIUDAD "]
[null,null,null,null,null,null,1,"HACER CLIC AL BOTÓN ABAJO 3 VECES",4,{"$f":"IFERROR(INDEX(DATOS!$H$37:$H$216, SMALL(IF(DATOS!$G$37:$G$216=DATOS!D7, ROW(DATOS!$G$37:$G$216)-ROW(DATOS!$G$37)+1), DATOS!J37)), \"\")","v":""}]
[null,null,null,null,null,null,1,"HACER CLIC AL BOTÓN ABAJO 4 VECES",5]
[null,null,null,null,null,null,1,"HACER CLIC AL BOTÓN ABAJO 5 VECES",6]
[null,null,null,null,null,null,1,"HACER CLIC AL BOTÓN ABAJO 6 VECES",7]
[null,null,null,null,null,null,1,"HACER CLIC AL BOTÓN ABAJO 7 VECES",8]
[null,null,null,null,null,null,1,"HACER CLIC AL BOTÓN ABAJO 8 VECES",9]
[null,null,null,null,null,null,1,"HACER CLIC AL BOTÓN ABAJO 9 VECES",10]
[null,null,null,null,null,null,2,"COLONIA INDEPENDENCIA",1]
[null,null,null,null,null,null,2,"VILLARRICA",2]
[null,null,null,null,null,null,2,"HACER CLIC AL BOTÓN ABAJO 1 VEZ",3]
[null,null,null,null,null,null,2,"HACER CLIC AL BOTÓN ABAJO 2 VECES",4]
[null,null,null,null,null,null,2,"HACER CLIC AL BOTÓN ABAJO 3 VECES",5]
[null,null,null,null,null,null,2,"HACER CLIC AL BOTÓN ABAJO 4 VECES",6]
[null,null,null,null,null,null,2,"HACER CLIC AL BOTÓN ABAJO 5 VECES",7]
[null,null,null,null,null,null,2,"HACER CLIC AL BOTÓN ABAJO 6 VECES",8]
[null,null,null,null,null,null,2,"HACER CLIC AL BOTÓN ABAJO 7 VECES",9]
[null,null,null,null,null,null,2,"HACER CLIC AL BOTÓN ABAJO 8 VECES",10]
[null,null,null,null,null,null,3,"ENCARNACIÓN",1]
[null,null,null,null,null,null,3,"HOHENAU",2]
[null,null,null,null,null,null,3,"OBLIGADO",3]
[null,null,null,null,null,null,3,"SAN PEDRO DEL PARANÁ",4]
[null,null,null,null,null,null,3,"TOMÁS ROMERO PEREIRA ",5]
[null,null,null,null,null,null,3,"HACER CLIC AL BOTÓN ABAJO 1 VEZ",6]
[null,null,null,null,null,null,3,"HACER CLIC AL BOTÓN ABAJO 2 VECES",7]
[null,null,null,null,null,null,3,"HACER CLIC AL BOTÓN ABAJO 3 VECES",8]
[null,null,null,null,null,null,3,"HACER CLIC AL BOTÓN ABAJO 4 VECES",9]
[null,null,null,null,null,null,3,"HACER CLIC AL BOTÓN ABAJO 5 VECES",10]
[null,null,null,null,null,null,4,"CONCEPCIÓN",1]
[null,null,null,null,null,null,4,"HORQUETA",2]
[null,null,null,null,null,null,4,"HORQUETA Y ARROYITO",3]
[null,null,null,null,null,null,4,"VALLEMI",4]
[null,null,null,null,null,null,4,"YBY YAÚ Y AZOTE´Y",5]
[null,null,null,null,null,null,4,"HACER CLIC AL BOTÓN ABAJO 1 VEZ",6]
[null,null,null,null,null,null,4,"HACER CLIC AL BOTÓN ABAJO 2 VECES",7]
[null,null,null,null,null,null,4,"HACER CLIC AL BOTÓN ABAJO 3 VECES",8]
[null,null,null,null,null,null,4,"HACER CLIC AL BOTÓN ABAJO 4 VECES",9]
[null,null,null,null,null,null,4,"HACER CLIC AL BOTÓN ABAJO 5 VECES",10]
[null,null,null,null,null,null,5,"BELLA VISTA NORTE",1]
[null,null,null,null,null,null,5,"CAPITÁN BADO",2]
[null,null,null,null,null,null,5,"PEDRO JUAN CABALLERO",3]
[null,null,null,null,null,null,5,"HACER CLIC AL BOTÓN ABAJO 1 VEZ",4]
[null,null,null,null,null,null,5,"HACER CLIC AL BOTÓN ABAJO 2 VECES",5]
[null,null,null,null,null,null,5,"HACER CLIC AL BOTÓN ABAJO 3 VECES",6]
[null,null,null,null,null,null,5,"HACER CLIC AL BOTÓN ABAJO 4 VECES",7]
[null,null,null,null,null,null,5,"HACER CLIC AL BOTÓN ABAJO 5 VECES",8]
[null,null,null,null,null,null,5,"HACER CLIC AL BOTÓN ABAJO 6 VECES",9]
[null,null,null,null,null,null,5,"HACER CLIC AL BOTÓN ABAJO 7 VECES",10]
[null,null,null,null,null,null,6,"CIUDAD DEL ESTE",1]
[null,null,null,null,null,null,6,"DOCTOR JUAN LEÓN MALLORQUÍN",2]
[null,null,null,null,null,null,6,"HERNANDARIAS",3]
[null,null,null,null,null,null,6,"IRUÑA",4]
[null,null,null,null,null,null,6,"ITAKYRY",5]
[null,null,null,null,null,null,6,"MINGA PORÁ",6]
[null,null,null,null,null,null,6,"NARANJAL",7]
[null,null,null,null,null,null,6,"PRESIDENTE FRANCO",8]
[null,null,null,null,null,null,6,"SAN ALBERTO",9]
[null,null,null,null,null,null,6,"SANTA RITA"]
[null,null,null,null,null,null,7,"CAAGUAZÚ",1]
[null,null,null,null,null,null,7,"CORONEL OVIEDO",2]
[null,null,null,null,null,null,7," JUAN EULOGIO ESTIGARRIBIA",3]
[null,null,null,null,null,null,7,"HACER CLIC AL BOTÓN ABAJO 1 VEZ",4]
[null,null,null,null,null,null,7,"HACER CLIC AL BOTÓN ABAJO 2 VECES",5]
[null,null,null,null,null,null,7,"HACER CLIC AL BOTÓN ABAJO 3 VECES",6]
[null,null,null,null,null,null,7,"HACER CLIC AL BOTÓN ABAJO 4 VECES",7]
[null,null,null,null,null,null,7,"HACER CLIC AL BOTÓN ABAJO 5 VECES",8]
[null,null,null,null,null,null,7,"HACER CLIC AL BOTÓN ABAJO 6 VECES",9]
[null,null,null,null,null,null,7,"HACER CLIC AL BOTÓN ABAJO 7 VECES",10]
[null,null,null,null,null,null,8,"ALBERDI-VILLA FRANCA-VILLA OLIVA",1]
[null,null,null,null,null,null,8,"GENERAL JOSÉ EDUVIGIS DÍAZ",2]
[null,null,null,null,null,null,8,"PILAR",3]
[null,null,null,null,null,null,8,"HACER CLIC AL BOTÓN ABAJO 1 VEZ",4]
[null,null,null,null,null,null,8,"HACER CLIC AL BOTÓN ABAJO 2 VECES",5]
[null,null,null,null,null,null,8,"HACER CLIC AL BOTÓN ABAJO 3 VECES",6]
[null,null,null,null,null,null,8,"HACER CLIC AL BOTÓN ABAJO 4 VECES",7]
[null,null,null,null,null,null,8,"HACER CLIC AL BOTÓN ABAJO 5 VECES",8]
[null,null,null,null,null,null,8,"HACER CLIC AL BOTÓN ABAJO 6 VECES",9]
[null,null,null,null,null,null,8,"HACER CLIC AL BOTÓN ABAJO 7 VECES",10]
[null,null,null,null,null,null,9,"AYOLAS",1]
[null,null,null,null,null,null,9,"SAN IGNACIO GUAZÚ",2]
[null,null,null,null,null,null,9,"SAN JUAN BAUTISTA",3]
[null,null,null,null,null,null,9,"HACER CLIC AL BOTÓN ABAJO 1 VEZ",4]
[null,null,null,null,null,null,9,"HACER CLIC AL BOTÓN ABAJO 2 VECES",5]
[null,null,null,null,null,null,9,"HACER CLIC AL BOTÓN ABAJO 3 VECES",6]
[null,null,null,null,null,null,9,"HACER CLIC AL BOTÓN ABAJO 4 VECES",7]
[null,null,null,null,null,null,9,"HACER CLIC AL BOTÓN ABAJO 5 VECES",8]
[null,null,null,null,null,null,9,"HACER CLIC AL BOTÓN ABAJO 6 VECES",9]
[null,null,null,null,null,null,9,"HACER CLIC AL BOTÓN ABAJO 7 VECES",10]
[null,null,null,null,null,null,10,"CARAPEGUÁ",1]
[null,null,null,null,null,null,10,"PARAGUARÍ",2]
[null,null,null,null,null,null,10,"QUIINDY",3]
[null,null,null,null,null,null,10,"YBYCUI",4]
[null,null,null,null,null,null,10,"HACER CLIC AL BOTÓN ABAJO 1 VEZ",5]
[null,null,null,null,null,null,10,"HACER CLIC AL BOTÓN ABAJO 2 VECES",6]
[null,null,null,null,null,null,10,"HACER CLIC AL BOTÓN ABAJO 3 VECES",7]
[null,null,null,null,null,null,10,"HACER CLIC AL BOTÓN ABAJO 4 VECES",8]
[null,null,null,null,null,null,10,"HACER CLIC AL BOTÓN ABAJO 5 VECES",9]
[null,null,null,null,null,null,10,"HACER CLIC AL BOTÓN ABAJO 6 VECES",10]
[null,null,null,null,null,null,11,"CAAZAPÁ",1]
[null,null,null,null,null,null,11,"SAN JUAN NEPOMUCENO",2]
[null,null,null,null,null,null,11,"YUTY",3]
[null,null,null,null,null,null,11,"HACER CLIC AL BOTÓN ABAJO 1 VEZ",4]
[null,null,null,null,null,null,11,"HACER CLIC AL BOTÓN ABAJO 2 VECES",5]
[null,null,null,null,null,null,11,"HACER CLIC AL BOTÓN ABAJO 3 VECES",6]
[null,null,null,null,null,null,11,"HACER CLIC AL BOTÓN ABAJO 4 VECES",7]
[null,null,null,null,null,null,11,"HACER CLIC AL BOTÓN ABAJO 5 VECES",8]
[null,null,null,null,null,null,11,"HACER CLIC AL BOTÓN ABAJO 6 VECES",9]
[null,null,null,null,null,null,11,"HACER CLIC AL BOTÓN ABAJO 7 VECES",10]
[null,null,null,null,null,null,12,"SAN ESTANISLAO",1]
[null,null,null,null,null,null,12,"SAN PEDRO DE YCUAMANDYYÚ",2]
[null,null,null,null,null,null,12,"SANTA ROSA DEL AGUARAY",3]
[null,null,null,null,null,null,12,"HACER CLIC AL BOTÓN ABAJO 1 VEZ",4]
[null,null,null,null,null,null,12,"HACER CLIC AL BOTÓN ABAJO 2 VECES",5]
[null,null,null,null,null,null,12,"HACER CLIC AL BOTÓN ABAJO 3 VECES",6]
[null,null,null,null,null,null,12,"HACER CLIC AL BOTÓN ABAJO 4 VECES",7]
[null,null,null,null,null,null,12,"HACER CLIC AL BOTÓN ABAJO 5 VECES",8]
[null,null,null,null,null,null,12,"HACER CLIC AL BOTÓN ABAJO 6 VECES",9]
[null,null,null,null,null,null,12,"HACER CLIC AL BOTÓN ABAJO 7 VECES",10]
[null,null,null,null,null,null,13,"CAACUPÉ",1]
[null,null,null,null,null,null,13,"HACER CLIC AL BOTÓN ABAJO 1 VEZ",2]
[null,null,null,null,null,null,13,"HACER CLIC AL BOTÓN ABAJO 2 VECES",3]
[null,null,null,null,null,null,13,"HACER CLIC AL BOTÓN ABAJO 3 VECES",4]
[null,null,null,null,null,null,13,"HACER CLIC AL BOTÓN ABAJO 4 VECES",5]
[null,null,null,null,null,null,13,"HACER CLIC AL BOTÓN ABAJO 5 VECES",6]
[null,null,null,null,null,null,13,"HACER CLIC AL BOTÓN ABAJO 6 VECES",7]
[null,null,null,null,null,null,13,"HACER CLIC AL BOTÓN ABAJO 7 VECES",8]
[null,null,null,null,null,null,13,"HACER CLIC AL BOTÓN ABAJO 8 VECES",9]
[null,null,null,null,null,null,13,"HACER CLIC AL BOTÓN ABAJO 9 VECES",10]
[null,null,null,null,null,null,14,"POZO COLORADO",1]
[null,null,null,null,null,null,14,"VILLA HAYES",2]
[null,null,null,null,null,null,14,"HACER CLIC AL BOTÓN ABAJO 1 VEZ",3]
[null,null,null,null,null,null,14,"HACER CLIC AL BOTÓN ABAJO 2 VECES",4]
[null,null,null,null,null,null,14,"HACER CLIC AL BOTÓN ABAJO 3 VECES",5]
[null,null,null,null,null,null,14,"HACER CLIC AL BOTÓN ABAJO 4 VECES",6]
[null,null,null,null,null,null,14,"HACER CLIC AL BOTÓN ABAJO 5 VECES",7]
[null,null,null,null,null,null,14,"HACER CLIC AL BOTÓN ABAJO 6 VECES",8]
[null,null,null,null,null,null,14,"HACER CLIC AL BOTÓN ABAJO 7 VECES",9]
[null,null,null,null,null,null,14,"HACER CLIC AL BOTÓN ABAJO 8 VECES",10]
[null,null,null,null,null,null,15,"CURUGUATY",1]
[null,null,null,null,null,null,15,"KATUETÉ",2]
[null,null,null,null,null,null,15,"SALTOS DEL GUAIRÁ",3]
[null,null,null,null,null,null,15,"HACER CLIC AL BOTÓN ABAJO 1 VEZ",4]
[null,null,null,null,null,null,15,"HACER CLIC AL BOTÓN ABAJO 2 VECES",5]
[null,null,null,null,null,null,15,"HACER CLIC AL BOTÓN ABAJO 3 VECES",6]
[null,null,null,null,null,null,15,"HACER CLIC AL BOTÓN ABAJO 4 VECES",7]
[null,null,null,null,null,null,15,"HACER CLIC AL BOTÓN ABAJO 5 VECES",8]
[null,null,null,null,null,null,15,"HACER CLIC AL BOTÓN ABAJO 6 VECES",9]
[null,null,null,null,null,null,15,"HACER CLIC AL BOTÓN ABAJO 7 VECES",10]
[null,null,null,null,null,null,16,"CAPIATÁ",1]
[null,null,null,null,null,null,16,"FERNANDO DE LA MORA",2]
[null,null,null,null,null,null,16,"JULIÁN AUGUSTO SALDÍVAR ",3]
[null,null,null,null,null,null,16,"LAMBARÉ",4]
[null,null,null,null,null,null,16,"LIMPIO",5]
[null,null,null,null,null,null,16,"LUQUE ",6]
[null,null,null,null,null,null,16,"SAN LORENZO ",7]
[null,null,null,null,null,null,16,"HACER CLIC AL BOTÓN ABAJO 1 VEZ",8]
[null,null,null,null,null,null,16,"HACER CLIC AL BOTÓN ABAJO 2 VECES",9]
[null,null,null,null,null,null,16,"HACER CLIC AL BOTÓN ABAJO 3 VECES",10]
[null,null,null,null,null,null,17,"FILADELFIA",1]
[null,null,null,null,null,null,17,"MARISCAL ESTIGARRIBIA",2]
[null,null,null,null,null,null,17,"NEULAND",3]
[null,null,null,null,null,null,17,"HACER CLIC AL BOTÓN ABAJO 1 VEZ",4]
[null,null,null,null,null,null,17,"HACER CLIC AL BOTÓN ABAJO 2 VECES",5]
[null,null,null,null,null,null,17,"HACER CLIC AL BOTÓN ABAJO 3 VECES",6]
[null,null,null,null,null,null,17,"HACER CLIC AL BOTÓN ABAJO 4 VECES",7]
[null,null,null,null,null,null,17,"HACER CLIC AL BOTÓN ABAJO 5 VECES",8]
[null,null,null,null,null,null,17,"HACER CLIC AL BOTÓN ABAJO 6 VECES",9]
[null,null,null,null,null,null,17,"HACER CLIC AL BOTÓN ABAJO 7 VECES",10]
[null,null,null,null,null,null,18,"BAHÍA NEGRA",1]
[null,null,null,null,null,null,18,"CARMELO PERALTA",2]
[null,null,null,null,null,null,18,"FUERTE OLIMPO",3]
[null,null,null,null,null,null,18,"PUERTO CASADO",4]
[null,null,null,null,null,null,18,"HACER CLIC AL BOTÓN ABAJO 1 VEZ",5]
[null,null,null,null,null,null,18,"HACER CLIC AL BOTÓN ABAJO 2 VECES",6]
[null,null,null,null,null,null,18,"HACER CLIC AL BOTÓN ABAJO 3 VECES",7]
[null,null,null,null,null,null,18,"HACER CLIC AL BOTÓN ABAJO 4 VECES",8]
[null,null,null,null,null,null,18,"HACER CLIC AL BOTÓN ABAJO 5 VECES",9]
[null,null,null,null,null,null,18,"HACER CLIC AL BOTÓN ABAJO 6 VECES",10]