{"text_format":"1","workbook":"xlsx","n_sheets":2,"sheets":["2° INST_MONO_CyC_L_NyA_CA","DATOS"],"not_rendered":{"charts":0,"images":0,"macros":1,"external_links":0,"defined_names":0,"comments":0,"pivot_tables":0},"unopened":[],"bounds":{"document_bytes":16777216,"sheet_cells":100000,"rows_first":2000,"rows_last":500,"rows_between":2000,"halvings":0,"cell_chars":16384,"cell_head_chars":4096},"cells_cut":0,"cells_raw":0,"read":"whole","date_system":"1900"}

{"sheet":"2° INST_MONO_CyC_L_NyA_CA","index":0,"n_rows":1013,"n_cols":20,"rows_kept":1013,"cut":false,"hidden":false,"merged":[[10,0,10,2],[9,9,9,10],[8,9,8,10],[3,3,3,14],[9,0,9,2],[8,0,8,2],[4,0,4,2],[3,0,3,2],[5,3,5,14],[7,3,7,8],[6,3,6,8],[7,9,7,10],[6,9,6,10],[7,11,7,14],[6,11,6,14],[11,7,12,7],[8,19,9,19],[11,19,12,19],[11,8,11,9],[11,10,11,14],[11,15,11,18],[10,15,10,19],[10,11,10,12],[9,11,9,12],[10,3,10,8],[9,3,9,8],[8,3,8,8],[10,9,10,10],[11,0,12,0],[11,1,12,1],[11,2,12,2],[11,3,12,3],[11,4,11,6],[0,0,0,19],[1,0,1,19],[2,17,2,18],[4,19,5,19],[4,15,9,16],[4,17,5,18],[6,17,7,18],[8,17,9,18],[2,0,2,2],[2,3,2,14],[7,0,7,2],[6,0,6,2],[5,0,5,2],[8,11,8,14],[6,19,7,19],[4,3,4,14]]}
["TRIBUNALES DE SEGUNDA INSTANCIA DE LA REPÚBLICA DEL PARAGUAY"]
["APLICA PARA LOS TRIBUNALES MONO FUERO CIVIL Y COMERCIAL O LABORAL O DE LA NIÑEZ Y DE LA ADOLESCENCIA O CONTENCIOSO ADMINISTRATIVO"]
["CIRCUNSCRIPCIÓN JUDICIAL: ",null,null,{"$f":"IF(DATOS!D18=0,\"SELECCIONE SU CIRCUNSCRIPCIÓN----->\",IF(DATOS!D18=1,\"1° CAPITAL\",IF(DATOS!D18=2,\"2° GUAIRÁ\",IF(DATOS!D18=3,\"3° ITAPÚA\",IF(DATOS!D18=4,\"4° CONCEPCIÓN\",IF(DATOS!D18=5,\"5°AMAMBAY\",IF(DATOS!D18=6,\"6° ALTO PARANÁ\",IF(DATOS!D18=7,\"7° CAAGUAZÚ\",IF(DATOS!D18=8,\" 8° ÑEEMBUCÚ\",IF(DATOS!D18=9,\" 9° MISIONES\",IF(DATOS!D18=10,\"10° PARAGUARÍ\",IF(DATOS!D18=11,\"11° CAAZAPÁ\",IF(DATOS!D18=12,\"12° SAN PEDRO\",IF(DATOS!D18=13,\"13° CORDILLERA\",IF(DATOS!D18=14,\"14° PRESIDENTE HAYES\",IF(DATOS!D18=15,\"15° CANINDEYÚ\",IF(DATOS!D18=16,\"16° CENTRAL\",IF(DATOS!D18=17,\"17° BOQUERÓN\",IF(DATOS!D18=18,\"18° ALTO PARAGUAY\")))))))))))))))))))","v":"SELECCIONE SU CIRCUNSCRIPCIÓN----->"},null,null,null,null,null,null,null,null,null,null,null,"AÑO:",null,"INGRESE FECHA DE CORTE"]
["CIUDAD:",null,null,{"$f":"IF(DATOS!D18=0,\"SELECCIONANDO LA CIRCUNSCRIPCIÓN ESTE CAMPO SE AUTO COMPLETARA DE MANERA AUTOMATICA\",DATOS!K6)","v":"SELECCIONANDO LA CIRCUNSCRIPCIÓN ESTE CAMPO SE AUTO COMPLETARA DE MANERA AUTOMATICA"}]
["TRIBUNAL DE SEGUNDA INSTANCIA:",null,null,{"$f":"IF(DATOS!F40=0,\"SELECCIONE SU TRIBUNAL----->\",IF(DATOS!F40=1,DATOS!D40,IF(DATOS!F40=2,DATOS!D41,IF(DATOS!F40=3,DATOS!D42,IF(DATOS!F40=4,DATOS!D43)))))","v":"SELECCIONE SU TRIBUNAL----->"},null,null,null,null,null,null,null,null,null,null,null,"PERIODO - CUATRIMESTRE",null,"1° CUATRIMESTRE "]
["SALA N°:",null,null,{"$f":"IF(DATOS!D21=0,\"SELECCIONE SU SALA----->\",IF(DATOS!D21=1,\"ÚNICA SALA\",IF(DATOS!D21=2,\"S1\",IF(DATOS!D21=3,\"S2\",IF(DATOS!D21=4,\"S3\",IF(DATOS!D21=5,\"S4\",IF(DATOS!D21=6,\"S5\",IF(DATOS!D21=7,\"S6\",IF(DATOS!D21=8,\"S7\",IF(DATOS!D21=9,\"S8\",IF(DATOS!D21=10,\"S9\",IF(DATOS!D21=11,\"S10\"))))))))))))","v":"SELECCIONE SU SALA----->"}]
["NOMBRE COMPLETO DEL PRESIDENTE:",null,null,null,null,null,null,null,null,"VINCULACIÓN",null,null,null,null,null,null,null,"2° CUATRIMESTRE "]
["NOMBRE COMPLETO DEL VICEPRESIDENTE:",null,null,null,null,null,null,null,null,"VINCULACIÓN"]
["NOMBRE COMPLETO DEL VOCAL:",null,null,null,null,null,null,null,null,"VINCULACIÓN",null,null,null,null,null,null,null,"3° CUATRIMESTRE "]
["NOMBRE COMPLETO DEL ACTUARIO/A:",null,null,null,null,null,null,null,null,"VINCULACIÓN",null,null,null,"SECRETARÍA N°"]
["NOMBRE COMPLETO DEL ACTUARIO/A:",null,null,null,null,null,null,null,null,"VINCULACIÓN",null,null,null,"SECRETARÍA N°"]
["N°                            ITEM","CARÁTULA COMPLETA "," N° EXPEDIENTE","AÑO","RESOLUCIÓN APELADA",null,null,"FUERO","ÚLTIMO ACTO PROCESAL",null,"PENDENCIA",null,null,null,null,"MEDIDAS DE MEJOR PROVEER",null,null,null,"SECRETARIA N°"]
[null,null,null,null,"TIPO DE RESOLUCIÓN","NÚMERO","FECHA",null,"FECHA ","TIPO DE ACTO","FECHA DE PROVIDENCIA DE LLAMADO A AUTOS","TIPO DE PENDENCIA","FECHA DE INGRESO A  DESPACHO / SECRETARÍA","A CARGO DE ","PENDIENTE DE ","SE DICTÓ MEDIDA DE MEJOR PROVEER","FECHA EN QUE SE DICTÓ LA MEDIDA ","CUMPLIMIENTO\n DE LA MEDIDA","FECHA EN QUE SE CUMPLIÓ LA MEDIDA "]
[1]
[{"$f":"IF(B15<>\"\",A14+1,\"\")","v":""}]
[""]
[""]
[""]
[""]
[""]
[""]
[""]
[""]
[""]
[""]
[""]
[""]
[""]
[""]
[""]
[""]
[""]
[""]
[""]
[""]
[""]
[""]
[""]
[""]
[""]
[""]
[""]
[""]
[""]
[""]
[""]
[""]
[""]
[""]
[""]
[""]
[""]
[""]
[""]
[""]
[""]
[""]
[""]
[""]
[""]
[""]
[""]
[""]
[""]
[""]
[""]
[""]
[""]
[""]
[""]
[""]
[""]
[""]
[""]
[""]
[""]
[""]
[""]
[{"$f":"IF(B79<>\"\",A78+1,\"\")","v":""}]
[""]
[""]
[""]
[""]
[""]
[""]
[""]
[""]
[""]
[""]
[""]
[""]
[""]
[""]
[""]
[""]
[""]
[""]
[""]
[""]
[""]
[""]
[""]
[""]
[""]
[""]
[""]
[""]
[""]
[""]
[""]
[""]
[""]
[""]
[""]
[""]
[""]
[""]
[""]
[""]
[""]
[""]
[""]
[""]
[""]
[""]
[""]
[""]
[""]
[""]
[""]
[""]
[""]
[""]
[""]
[""]
[""]
[""]
[""]
[""]
[""]
[""]
[""]
[{"$f":"IF(B143<>\"\",A142+1,\"\")","v":""}]
[""]
[""]
[""]
[""]
[""]
[""]
[""]
[""]
[""]
[""]
[""]
[""]
[""]
[""]
[""]
[""]
[""]
[""]
[""]
[""]
[""]
[""]
[""]
[""]
[""]
[""]
[""]
[""]
[""]
[""]
[""]
[""]
[""]
[""]
[""]
[""]
[""]
[""]
[""]
[""]
[""]
[""]
[""]
[""]
[""]
[""]
[""]
[""]
[""]
[""]
[""]
[""]
[""]
[""]
[""]
[""]
[""]
[""]
[""]
[""]
[""]
[""]
[""]
[{"$f":"IF(B207<>\"\",A206+1,\"\")","v":""}]
[""]
[""]
[""]
[""]
[""]
[""]
[""]
[""]
[""]
[""]
[""]
[""]
[""]
[""]
[""]
[""]
[""]
[""]
[""]
[""]
[""]
[""]
[""]
[""]
[""]
[""]
[""]
[""]
[""]
[""]
[""]
[""]
[""]
[""]
[""]
[""]
[""]
[""]
[""]
[""]
[""]
[""]
[""]
[""]
[""]
[""]
[""]
[""]
[""]
[""]
[""]
[""]
[""]
[""]
[""]
[""]
[""]
[""]
[""]
[""]
[""]
[""]
[""]
[{"$f":"IF(B271<>\"\",A270+1,\"\")","v":""}]
[""]
[""]
[""]
[""]
[""]
[""]
[""]
[""]
[""]
[""]
[""]
[""]
[""]
[""]
[""]
[""]
[""]
[""]
[""]
[""]
[""]
[""]
[""]
[""]
[""]
[""]
[""]
[""]
[""]
[""]
[""]
[""]
[""]
[""]
[""]
[""]
[""]
[""]
[""]
[""]
[""]
[""]
[""]
[""]
[""]
[""]
[""]
[""]
[""]
[""]
[""]
[""]
[""]
[""]
[""]
[""]
[""]
[""]
[""]
[""]
[""]
[""]
[""]
[{"$f":"IF(B335<>\"\",A334+1,\"\")","v":""}]
[""]
[""]
[""]
[""]
[""]
[""]
[""]
[""]
[""]
[""]
[""]
[""]
[""]
[""]
[""]
[""]
[""]
[""]
[""]
[""]
[""]
[""]
[""]
[""]
[""]
[""]
[""]
[""]
[""]
[""]
[""]
[""]
[""]
[""]
[""]
[""]
[""]
[""]
[""]
[""]
[""]
[""]
[""]
[""]
[""]
[""]
[""]
[""]
[""]
[""]
[""]
[""]
[""]
[""]
[""]
[""]
[""]
[""]
[""]
[""]
[""]
[""]
[""]
[{"$f":"IF(B399<>\"\",A398+1,\"\")","v":""}]
[""]
{"$rows_left_out":614}
{"sheet":"DATOS","index":1,"n_rows":59,"n_cols":11,"rows_kept":59,"cut":false,"hidden":true,"merged":[[1,1,2,19]]}
[]
[null,"VALIDACIONES DE LA PLANILLA DE PENDENCIA"]
[]
[]
[null,null,null,"VINCULACIÓN",null,"PENDIENTE DE ",null,"TIPO DE ACTO",null,null,"CIUDAD SEGÚN CIRCUNSCRIPCIÓN"]
[null,null,null,"TITULAR",null,"PROCESO DE VOTO DEL PRE-OPINANTE",null,"TRIBUNAL",null,null,{"$f":"IFERROR(INDEX(DATOS!$H$42:$H$59, SMALL(IF(DATOS!$G$42:$G$59=DATOS!D18, ROW(DATOS!$G$42:$G$59)-ROW(DATOS!$G$42)+1), DATOS!K9)), \"\")","v":""}]
[null,null,null,"INTERINO/A",null,"PROCESO DEL 2° VOTO",null,"PARTES"]
[null,null,null,"ITINERANTE",null,"PROCESO DEL 3°  VOTO",null,"OTROS",null,null,"SELEC / CIUDAD"]
[null,null,null,null,null,"FORMÚLESE RESOLUCIÓN",null,null,null,null,1]
[null,null,null,"A CARGO DE ",null,"SORTEO",null,"FUERO - CUERPO"]
[null,null,null,"PRESIDENTE",null,"PROCESO DE INTEGRACIÓN",null,"CIVIL Y COMERCIAL"]
[null,null,null,"VICEPRESIDENTE",null,"PROCESO DE FIRMA (EN LIMPIO)",null,"LABORAL"]
[null,null,null,"VOCAL",null,null,null,"NIÑEZ Y ADOLESCENCIA"]
[null,null,null,"MIEMBRO EXTERNO",null,"OPCIONES SI O NO",null,"CONTENCIOSO ADMINISTRATIVO"]
[null,null,null,"SECRETARÍA",null,"SÍ"]
[null,null,null,null,null,"NO"]
[null,null,null,"SELEC /  CIRCUNSP"]
[null,null,null,0,null,"TIPO DE PENDENCIA"]
[null,null,null,null,null,"AUTOS PARA RESOLVER"]
[null,null,null,"SELEC / TURNO",null,"AUTOS PARA SENTENCIA",null,"CIRCUNSCRIPCIONES"]
[null,null,null,0,null,null,null,"1° CAPITAL"]
[null,null,null,null,null,null,null,"2° GUAIRÁ"]
[null,null,null,"SELEC / CUATRI",null,"SECRETARIAS N°",null,"3° ITAPÚA"]
[null,null,null,1,null,"ÚNICA",null,"4° CONCEPCIÓN"]
[null,null,null,null,null,1,null,"5° AMAMBAY"]
[null,null,null,"VINCULACIÓN",null,2,null,"6° ALTO PARANÁ"]
[null,null,null,"TITULAR",null,3,null,"7° CAAGUAZÚ"]
[null,null,null,"INTERINO/A",null,4,null,"8° ÑEEMBUCÚ"]
[null,null,null,"COMISIONADO/A",null,5,null,"9° MISIONES"]
[null,null,null,null,null,6,null,"10° PARAGUARÍ"]
[null,null,null,null,null,null,null,"11° CAAZAPÁ"]
[null,null,null,"TIPO DE RESOLUCIÓN",null,null,null,"12° SAN PEDRO"]
[null,null,null,"PROVIDENCIA",null,null,null,"13° CORDILLERA"]
[null,null,null,"A.I",null,null,null,"14° PRESIDENTE HAYES"]
[null,null,null,"S.D",null,null,null,"15° CANINDEYÚ"]
[null,null,null,"RESOLUCIÓN",null,null,null,"16° CENTRAL"]
[null,null,null,null,null,null,null,"17° BOQUERÓN"]
[null,null,null,null,null,null,null,"18° ALTO PARAGUAY"]
[null,null,null,"TRIBUNAL DE SEGUNDA INSTANCIA -ENCABEZADO",null,"SELEC / FUERO"]
[null,null,null,"CIVIL Y COMERCIAL",null,0]
[null,null,null,"LABORAL",null,null,"N°","LOCALIDAD"]
[null,null,null,"NIÑEZ Y ADOLESCENCIA",null,null,1,"ASUNCIÓN "]
[null,null,null,"DE CUENTAS",null,null,2,"VILLARRICA"]
[null,null,null,null,null,null,3,"ENCARNACIÓN"]
[null,null,null,null,null,null,4,"CONCEPCIÓN"]
[null,null,null,null,null,null,5,"PEDRO JUAN CABALLERO"]
[null,null,null,null,null,null,6,"CIUDAD DEL ESTE"]
[null,null,null,null,null,null,7,"CORONEL OVIEDO"]
[null,null,null,null,null,null,8,"PILAR"]
[null,null,null,null,null,null,9,"SAN JUAN BAUTISTA"]
[null,null,null,null,null,null,10,"PARAGUARÍ"]
[null,null,null,null,null,null,11,"CAAZAPÁ"]
[null,null,null,null,null,null,12,"SAN PEDRO DE YCUAMANDYYÚ"]
[null,null,null,null,null,null,13,"CAACUPÉ"]
[null,null,null,null,null,null,14,"VILLA HAYES"]
[null,null,null,null,null,null,15,"SALTOS DEL GUAIRÁ"]
[null,null,null,null,null,null,16,"SAN LORENZO"]
[null,null,null,null,null,null,17,"FILADELFIA"]
[null,null,null,null,null,null,18,"FUERTE OLIMPO"]