{"text_format":"1","workbook":"xlsx","n_sheets":2,"sheets":["2° INST_MULTI","DATOS"],"not_rendered":{"charts":0,"images":0,"macros":1,"external_links":0,"defined_names":11,"comments":0,"pivot_tables":0},"unopened":[],"bounds":{"document_bytes":16777216,"sheet_cells":100000,"rows_first":2000,"rows_last":500,"rows_between":2000,"halvings":0,"cell_chars":16384,"cell_head_chars":4096},"cells_cut":0,"cells_raw":0,"read":"whole","date_system":"1900"}

{"sheet":"2° INST_MULTI","index":0,"n_rows":1013,"n_cols":21,"rows_kept":1013,"cut":false,"hidden":false,"merged":[[4,3,4,15],[6,18,7,19],[5,3,5,15],[6,12,6,15],[7,12,7,15],[6,3,6,9],[6,10,6,11],[7,10,7,11],[8,18,9,19],[4,20,5,20],[0,0,0,20],[1,0,1,20],[2,18,2,19],[3,16,3,20],[6,20,7,20],[8,20,9,20],[4,16,9,17],[4,18,5,19],[6,0,6,2],[5,0,5,2],[4,0,4,2],[3,0,3,2],[2,3,2,15],[3,3,3,15],[11,20,12,20],[11,8,11,9],[11,10,11,15],[11,16,11,19],[10,16,10,20],[10,10,10,11],[11,7,12,7],[11,0,12,0],[11,1,12,1],[11,2,12,2],[11,3,12,3],[11,4,11,6],[10,0,10,2],[9,0,9,2],[8,0,8,2],[7,0,7,2],[10,3,10,9],[7,3,7,9],[9,3,9,9],[8,3,8,9],[9,10,9,11],[8,10,8,11],[10,12,10,13],[9,12,9,13],[8,12,8,15]]}
["TRIBUNALES DE SEGUNDA INSTANCIA DE LA REPÚBLICA DEL PARAGUAY"]
["APLICA PARA LOS TRIBUNALES MULTIFUEROS QUE ENTIENDEN EN MÁS DE UNO DE LOS SIGUIENTES FUEROS: CIVIL Y COMERCIAL Y/O LABORAL Y/O NIÑEZ Y ADOLESCENCIA Y/O PENAL"]
["CIRCUNSCRIPCIÓN JUDICIAL: ",null,null,{"$f":"IF(DATOS!D18=0,\"SELECCIONE SU CIRCUNSCRIPCIÓN----->\",IF(DATOS!D18=1,\"1° CAPITAL\",IF(DATOS!D18=2,\"2° GUAIRÁ\",IF(DATOS!D18=3,\"3° ITAPÚA\",IF(DATOS!D18=4,\"4° CONCEPCIÓN\",IF(DATOS!D18=5,\"5°AMAMBAY\",IF(DATOS!D18=6,\"6° ALTO PARANÁ\",IF(DATOS!D18=7,\"7° CAAGUAZÚ\",IF(DATOS!D18=8,\" 8° ÑEEMBUCÚ\",IF(DATOS!D18=9,\" 9° MISIONES\",IF(DATOS!D18=10,\"10° PARAGUARÍ\",IF(DATOS!D18=11,\"11° CAAZAPÁ\",IF(DATOS!D18=12,\"12° SAN PEDRO\",IF(DATOS!D18=13,\"13° CORDILLERA\",IF(DATOS!D18=14,\"14° PRESIDENTE HAYES\",IF(DATOS!D18=15,\"15° CANINDEYÚ\",IF(DATOS!D18=16,\"16° CENTRAL\",IF(DATOS!D18=17,\"17° BOQUERÓN\",IF(DATOS!D18=18,\"18° ALTO PARAGUAY\")))))))))))))))))))","v":"SELECCIONE SU CIRCUNSCRIPCIÓN----->"},null,null,null,null,null,null,null,null,null,null,null,null,"AÑO:",null,"INGRESE FECHA DE CORTE"]
["CIUDAD:",null,null,{"$f":"IF(DATOS!D18=0,\"SELECCIONANDO LA CIRCUNSCRIPCIÓN ESTE CAMPO SE AUTO COMPLETARA DE MANERA AUTOMATICA\",DATOS!K6)","v":"SELECCIONANDO LA CIRCUNSCRIPCIÓN ESTE CAMPO SE AUTO COMPLETARA DE MANERA AUTOMATICA"}]
["TRIBUNAL DE SEGUNDA INSTANCIA:",null,null,{"$f":"IF(DATOS!F45=0,\"SELECCIONE SU TRIBUNAL----->\",IF(DATOS!F45=1,DATOS!H45,IF(DATOS!F45=2,DATOS!H46,IF(DATOS!F45=3,DATOS!H47,IF(DATOS!F45=4,DATOS!H48,IF(DATOS!F45=5,DATOS!H49,IF(DATOS!F45=6,DATOS!H50,IF(DATOS!F45=7,DATOS!H51,IF(DATOS!F45=8,DATOS!H52,IF(DATOS!F45=9,DATOS!H53,IF(DATOS!F45=10,DATOS!H54,IF(DATOS!F45=11,DATOS!H55,IF(DATOS!F45=12,DATOS!H56,IF(DATOS!F45=13,DATOS!H57,IF(DATOS!F45=14,DATOS!H58,IF(DATOS!F45=15,DATOS!H59,IF(DATOS!F45=16,DATOS!H60)))))))))))))))))","v":"SELECCIONE SU TRIBUNAL----->"},null,null,null,null,null,null,null,null,null,null,null,null,"PERIODO - CUATRIMESTRE ",null,"1° CUATRIMESTRE "]
["SALA N°",null,null,{"$f":"IF(DATOS!D23=0,\"SELECCIONE SU SALA----->\",IF(DATOS!D23=1,\"ÚNICA SALA\",IF(DATOS!D23=2,\"S1\",IF(DATOS!D23=3,\"S2\",IF(DATOS!D23=4,\"S3\",IF(DATOS!D23=5,\"S4\",IF(DATOS!D23=6,\"S5\",IF(DATOS!D23=7,\"S6\",IF(DATOS!D23=8,\"S7\",IF(DATOS!D23=9,\"S8\",IF(DATOS!D23=10,\"S9\",IF(DATOS!D23=11,\"S10\"))))))))))))","v":"SELECCIONE SU SALA----->"}]
["NOMBRE COMPLETO DEL PRESIDENTE:",null,null,null,null,null,null,null,null,null,"VINCULACIÓN",null,null,null,null,null,null,null,"2° CUATRIMESTRE "]
["NOMBRE COMPLETO DEL VICEPRESIDENTE:",null,null,null,null,null,null,null,null,null,"VINCULACIÓN"]
["NOMBRE COMPLETO DEL VOCAL:",null,null,null,null,null,null,null,null,null,"VINCULACIÓN",null,null,null,null,null,null,null,"3° CUATRIMESTRE "]
["NOMBRE COMPLETO DEL ACTUARIO/A:",null,null,null,null,null,null,null,null,null,"VINCULACIÓN",null,null,null,"SECRETARÍA N°"]
["NOMBRE COMPLETO DEL ACTUARIO/A:",null,null,null,null,null,null,null,null,null,"VINCULACIÓN",null,null,null,"SECRETARÍA N°"]
["N°                            ITEM","CARÁTULA COMPLETA "," N° EXPEDIENTE / CAUSA N°","AÑO","RESOLUCIÓN APELADA",null,null,"FUERO","ÚLTIMO ACTO PROCESAL",null,"PENDENCIA",null,null,null,null,null,"MEDIDAS DE MEJOR PROVEER",null,null,null,"SECRETARIA N°"]
[null,null,null,null,"TIPO DE RESOLUCIÓN","NÚMERO","FECHA",null,"FECHA ","TIPO DE ACTO","FECHA DE PROVIDENCIA DE LLAMADO A AUTOS","FECHA DE SORTEO","TIPO DE PENDENCIA","FECHA DE INGRESO A  DESPACHO / SECRETARÍA","A CARGO DE ","PENDIENTE DE ","SE DICTÓ MEDIDA DE MEJOR PROVEER","FECHA EN QUE SE DICTÓ LA MEDIDA ","CUMPLIMIENTO\n DE LA MEDIDA","FECHA EN QUE SE CUMPLIÓ LA MEDIDA "]
[1]
[{"$f":"IF(B15<>\"\",A14+1,\"\")","v":""}]
[{"$f":"IF(B16<>\"\",A15+1,\"\")","v":""}]
[""]
[""]
[""]
[""]
[""]
[""]
[""]
[""]
[""]
[""]
[""]
[""]
[""]
[""]
[""]
[""]
[""]
[""]
[""]
[""]
[""]
[""]
[""]
[""]
[""]
[""]
[""]
[""]
[""]
[""]
[""]
[""]
[""]
[""]
[""]
[""]
[""]
[""]
[""]
[""]
[""]
[""]
[""]
[""]
[""]
[""]
[""]
[""]
[""]
[""]
[""]
[""]
[""]
[""]
[""]
[""]
[""]
[""]
[""]
[""]
[""]
[""]
[""]
[{"$f":"IF(B80<>\"\",A79+1,\"\")","v":""}]
[""]
[""]
[""]
[""]
[""]
[""]
[""]
[""]
[""]
[""]
[""]
[""]
[""]
[""]
[""]
[""]
[""]
[""]
[""]
[""]
[""]
[""]
[""]
[""]
[""]
[""]
[""]
[""]
[""]
[""]
[""]
[""]
[""]
[""]
[""]
[""]
[""]
[""]
[""]
[""]
[""]
[""]
[""]
[""]
[""]
[""]
[""]
[""]
[""]
[""]
[""]
[""]
[""]
[""]
[""]
[""]
[""]
[""]
[""]
[""]
[""]
[""]
[""]
[{"$f":"IF(B144<>\"\",A143+1,\"\")","v":""}]
[""]
[""]
[""]
[""]
[""]
[""]
[""]
[""]
[""]
[""]
[""]
[""]
[""]
[""]
[""]
[""]
[""]
[""]
[""]
[""]
[""]
[""]
[""]
[""]
[""]
[""]
[""]
[""]
[""]
[""]
[""]
[""]
[""]
[""]
[""]
[""]
[""]
[""]
[""]
[""]
[""]
[""]
[""]
[""]
[""]
[""]
[""]
[""]
[""]
[""]
[""]
[""]
[""]
[""]
[""]
[""]
[""]
[""]
[""]
[""]
[""]
[""]
[""]
[{"$f":"IF(B208<>\"\",A207+1,\"\")","v":""}]
[""]
[""]
[""]
[""]
[""]
[""]
[""]
[""]
[""]
[""]
[""]
[""]
[""]
[""]
[""]
[""]
[""]
[""]
[""]
[""]
[""]
[""]
[""]
[""]
[""]
[""]
[""]
[""]
[""]
[""]
[""]
[""]
[""]
[""]
[""]
[""]
[""]
[""]
[""]
[""]
[""]
[""]
[""]
[""]
[""]
[""]
[""]
[""]
[""]
[""]
[""]
[""]
[""]
[""]
[""]
[""]
[""]
[""]
[""]
[""]
[""]
[""]
[""]
[{"$f":"IF(B272<>\"\",A271+1,\"\")","v":""}]
[""]
[""]
[""]
[""]
[""]
[""]
[""]
[""]
[""]
[""]
[""]
[""]
[""]
[""]
[""]
[""]
[""]
[""]
[""]
[""]
[""]
[""]
[""]
[""]
[""]
[""]
[""]
[""]
[""]
[""]
[""]
[""]
[""]
[""]
[""]
[""]
[""]
[""]
[""]
[""]
[""]
[""]
[""]
[""]
[""]
[""]
[""]
[""]
[""]
[""]
[""]
[""]
[""]
[""]
[""]
[""]
[""]
[""]
[""]
[""]
[""]
[""]
[""]
[{"$f":"IF(B336<>\"\",A335+1,\"\")","v":""}]
[""]
[""]
[""]
[""]
[""]
[""]
[""]
[""]
[""]
[""]
[""]
[""]
[""]
[""]
[""]
[""]
[""]
[""]
[""]
[""]
[""]
[""]
[""]
[""]
[""]
[""]
[""]
[""]
[""]
[""]
[""]
[""]
[""]
[""]
[""]
[""]
[""]
[""]
[""]
[""]
[""]
[""]
[""]
[""]
[""]
[""]
[""]
[""]
[""]
[""]
[""]
[""]
[""]
[""]
[""]
[""]
[""]
[""]
[""]
[""]
[""]
[""]
[""]
[{"$f":"IF(B400<>\"\",A399+1,\"\")","v":""}]
{"$rows_left_out":614}
{"sheet":"DATOS","index":1,"n_rows":62,"n_cols":13,"rows_kept":62,"cut":false,"hidden":true,"merged":[[1,1,2,15]]}
[]
[null,"VALIDACIONES DE LA PLANILLA DE PENDENCIA"]
[]
[]
[null,null,null,"VINCULACIÓN",null,"PENDIENTE DE ",null,"TIPO DE ACTO",null,null,"CIUDAD SEGÚN CIRCUNSCRIPCIÓN"]
[null,null,null,"TITULAR",null,"PROCESO DE VOTO DEL PRE-OPINANTE",null,"TRIBUNAL",null,null,{"$f":"IFERROR(INDEX(DATOS!$D$45:$D$62, SMALL(IF(DATOS!$C$45:$C$62=DATOS!D18, ROW(DATOS!$C$45:$C$62)-ROW(DATOS!$C$45)+1), DATOS!K9)), \"\")","v":""}]
[null,null,null,"INTERINO/A",null,"PROCESO DEL 2° VOTO",null,"PARTES"]
[null,null,null,"ITINERANTE",null,"PROCESO DEL 3°  VOTO",null,"OTROS",null,null,"SELEC / CIUDAD"]
[null,null,null,null,null,"FORMÚLESE RESOLUCIÓN",null,null,null,null,1]
[null,null,null,"A CARGO DE ",null,"SORTEO",null,"FUERO - CUERPO"]
[null,null,null,"PRESIDENTE",null,"PROCESO DE INTEGRACIÓN",null,"CIVIL Y COMERCIAL"]
[null,null,null,"VICEPRESIDENTE",null,"PROCESO DE FIRMA (EN LIMPIO)",null,"LABORAL"]
[null,null,null,"VOCAL",null,null,null,"NIÑEZ Y ADOLESCENCIA"]
[null,null,null,"MIEMBRO EXTERNO",null,"OPCIONES SI O NO",null,"PENAL"]
[null,null,null,"SECRETARÍA",null,"SÍ",null,"PENAL DE LA ADOLESCENCIA"]
[null,null,null,null,null,"NO"]
[null,null,null,"SELEC /  CIRCUNSP"]
[null,null,null,0]
[null,null,null,null,null,"TIPO DE PENDENCIA"]
[null,null,null,null,null,"AUTOS PARA RESOLVER"]
[null,null,null,null,null,"AUTOS PARA SENTENCIA"]
[null,null,null,"SELEC / TURNO",null,"AUTO INTERLOCUTORIO",null,"CIRCUNSCRIPCIONES"]
[null,null,null,0,null,"ACUERDO Y SENTENCIA",null,"1° CAPITAL"]
[null,null,null,null,null,null,null,"2° GUAIRÁ"]
[null,null,null,"SELEC / CUATRI",null,null,null,"3° ITAPÚA"]
[null,null,null,2,null,null,null,"4° CONCEPCIÓN"]
[null,null,null,null,null,"SECRETARIAS N°",null,"5° AMAMBAY"]
[null,null,null,"VINCULACIÓN",null,"ÚNICA",null,"6° ALTO PARANÁ"]
[null,null,null,"TITULAR",null,1,null,"7° CAAGUAZÚ"]
[null,null,null,"INTERINO/A",null,2,null,"8° ÑEEMBUCÚ"]
[null,null,null,"COMISIONADO/A",null,3,null,"9° MISIONES"]
[null,null,null,null,null,4,null,"10° PARAGUARÍ"]
[null,null,null,null,null,5,null,"11° CAAZAPÁ"]
[null,null,null,null,null,6,null,"12° SAN PEDRO"]
[null,null,null,null,null,null,null,"13° CORDILLERA"]
[null,null,null,"TIPO DE RESOLUCIÓN",null,null,null,"14° PRESIDENTE HAYES",null,null,null,"FUEROS"]
[null,null,null,"PROVIDENCIA",null,null,null,"15° CANINDEYÚ",null,null,null,"CIVIL Y COMERCIAL"]
[null,null,null,"A.I",null,null,null,"16° CENTRAL",null,null,null,"LABORAL"]
[null,null,null,"S.D",null,null,null,"17° BOQUERÓN",null,null,null,"NIÑEZ Y ADOLESCENCIA"]
[null,null,null,null,null,null,null,"18° ALTO PARAGUAY",null,null,null,"PENAL"]
[null,null,null,null,null,null,null,null,null,null,null,"PENAL ADOLESCENTE"]
[]
[]
[null,null,"N°","CUIDAD ",null,"SELEC / ENCABEZADO",null,"TRIBUNALES DE SEGUNDA INSTANCIA - ENCABEZADO"]
[null,null,1,"ASUNCIÓN ",null,0,45,"CIVIL Y COMERCIAL"]
[null,null,2,"VILLARRICA",null,null,46,"LABORAL"]
[null,null,3,"ENCARNACIÓN",null,null,47,"NIÑEZ Y ADOLESCENCIA"]
[null,null,4,"CONCEPCIÓN",null,null,48,"PENAL"]
[null,null,5,"PEDRO JUAN CABALLERO",null,null,49,"PENAL ORDINARIO - CAPITAL"]
[null,null,6,"CIUDAD DEL ESTE",null,null,50,"PENAL DE LA ADOLESCENCIA"]
[null,null,7,"CORONEL OVIEDO",null,null,51,"PENAL EN DELITOS ECONÓMICOS Y CORRUPCIÓN Y CRIMEN ORGANIZADO - CAPITAL",null,null,null,"Civil y Comercial","AUTOS PARA RESOLVER "]
[null,null,8,"PILAR",null,null,52,"NIÑEZ Y ADOLESCENCIA Y PENAL DE LA ADOLESCENCIA",null,null,null,null,"AUTOS PARA SENTENCIA"]
[null,null,9,"SAN JUAN BAUTISTA",null,null,53,"CIVIL, COMERCIAL, LABORAL Y NIÑEZ Y ADOLESCENCIA",null,null,null,"Laboral","AUTOS PARA RESOLVER"]
[null,null,10,"PARAGUARÍ",null,null,54,"CIVIL, COMERCIAL Y LABORAL",null,null,null,null,"AUTOS PARA SENTENCIA"]
[null,null,11,"CAAZAPÁ",null,null,55,"CIVIL, COMERCIAL Y NIÑEZ Y ADOLESCENCIA",null,null,null,"Niñez y Adolescencia","AUTOS PARA RESOLVER"]
[null,null,12,"SAN PEDRO DE YCUAMANDYYÚ",null,null,56,"CIVIL, COMERCIAL, LABORAL, NIÑEZ Y ADOLESCENCIA Y PENAL",null,null,null,null,"AUTOS PARA SENTENCIA"]
[null,null,13,"CAACUPÉ",null,null,57,"CIVIL, COMERCIAL, LABORAL, NIÑEZ Y ADOLESCENCIA, PENAL Y PENAL DE LA ADOLESCENCIA",null,null,null,"Penal","AUTO INTERLOCUTORIO"]
[null,null,14,"VILLA HAYES",null,null,58,"CIVIL, COMERCIAL, LABORAL Y PENAL",null,null,null,null,"ACUERDO Y SENTENCIA"]
[null,null,15,"SALTOS DEL GUAIRÁ",null,null,59,"CIVIL, COMERCIAL, NIÑEZ Y ADOLESCENCIA,  Y PENAL",null,null,null,"Penal Adolescente","AUTO INTERLOCUTORIO"]
[null,null,16,"SAN LORENZO",null,null,60,"LABORAL Y PENAL ",null,null,null,null,"ACUERDO Y SENTENCIA"]
[null,null,17,"FILADELFIA"]
[null,null,18,"FUERTE OLIMPO"]